{"text_format":"1","workbook":"xlsx","n_sheets":8,"sheets":["Hoja4 (2)","CONSOLIDADOR","F1. INF. GENERAL","F6. REPOR CLF PRD ANUAL U ORD","F9. EV. EXTRAORDINARIA","F10. EVA. INFERIOR A 1 AÑO","Hoja1","Hoja4"],"not_rendered":{"charts":0,"images":3,"macros":1,"external_links":4,"defined_names":120,"comments":2,"pivot_tables":0},"unopened":[],"bounds":{"document_bytes":16777216,"sheet_cells":100000,"rows_first":2000,"rows_last":500,"rows_between":2000,"halvings":0,"cell_chars":16384,"cell_head_chars":4096},"cells_cut":0,"cells_raw":0,"read":"whole","date_system":"1900"}

{"sheet":"Hoja4 (2)","index":0,"n_rows":1199,"n_cols":34,"rows_kept":1199,"cut":false,"hidden":true,"merged":[[80,25,105,25],[17,17,18,17],[19,17,21,17],[22,17,24,17],[28,25,53,25],[54,25,79,25],[106,25,131,25],[132,25,157,25],[158,25,183,25],[184,25,209,25],[447,7,449,7],[447,8,449,9],[447,10,449,11],[450,8,450,9],[450,10,450,11],[451,8,451,9],[451,10,451,11],[452,8,452,9],[452,10,452,11],[501,0,501,1],[453,8,453,9],[453,10,453,11],[454,8,454,9],[454,10,454,11],[455,8,455,9],[455,10,455,11],[456,8,456,9],[456,10,456,11],[457,8,457,9],[457,10,457,11],[489,0,489,1]]}
[null,null,null,null,null,null,null,null,null,null,null,null,null,0]
["CODIGO",null,"DIRECTIVO",null,null,null,null,null,null,null,null,null,null,1,null,"2016-01-01",null,null,"SI",0.01,"NO SATISFACTORIO",null,null,null,null,"UNO"]
[1050,null,"ASESOR","MODIFICA LA CALIFICACIÓN",1,6,null,1,null,2016,null,65,null,2,null,"2016-01-02",null,null,"NO",0.02,"NO SATISFACTORIO",null,null,null,"CEDULA DE CIUDADANIA","UNO",1,"NO SATISFACTORIO"]
[1020,null,"PROFESIONAL","CONFIRMA LA CALIFICACIÓN",2,9,"X",2,null,2017,null,76,null,3,null,"2016-01-03",null,null,null,0.03,"NO SATISFACTORIO",null,null,null,null,"UNO",1.1000000000000001,"NO SATISFACTORIO"]
[1060,null,"TECNICO","RECHAZA POR EXTEMPORÁNEA",3,12,null,3,null,2018,null,null,null,4,null,"2016-01-04",null,null,null,0.04,"NO SATISFACTORIO",null,null,null,null,"UNO",1.2,"NO SATISFACTORIO"]
[1045,null,"ASISTENCIAL",null,4,15,null,4,null,2019,null,null,null,5,null,"2016-01-05",null,null,null,0.05,"NO SATISFACTORIO",null,null,null,null,"UNO",1.3,"NO SATISFACTORIO"]
[2025,null,null,null,5,4,null,5,null,2020,null,null,null,6,null,"2016-01-06",null,null,null,0.06,"NO SATISFACTORIO",null,null,null,null,"UNO",1.4,"NO SATISFACTORIO"]
[2001,null,null,null,6,6,null,6,null,2021,null,null,null,7,null,"2016-01-07",null,null,null,7.0000000000000007E-2,"NO SATISFACTORIO",null,null,null,"EVALUADO","UNO",1.5,"NO SATISFACTORIO"]
[2132,null,"CEDULA DE CIUDADANIA",null,7,8,null,7,null,2022,null,null,null,8,null,"2016-01-08",null,null,null,0.08,"NO SATISFACTORIO",null,null,null,"EVALUADOR","UNO",1.6,"NO SATISFACTORIO"]
[2133,null,"CEDULA DE EXTRAJERIA",null,8,10,null,8,null,2023,null,null,null,9,null,"2016-01-09",null,null,null,0.09,"NO SATISFACTORIO",1,1,null,"TERCERO","UNO",1.7,"NO SATISFACTORIO"]
[2002,null,null,null,9,null,null,9,null,2024,null,null,null,10,null,"2016-01-10",null,null,null,0.1,"NO SATISFACTORIO",2,2,null,null,"UNO",1.8,"NO SATISFACTORIO"]
[2125,null,null,null,10,null,null,10,null,2025,null,null,null,11,null,"2016-01-11",null,null,null,0.11,"NO SATISFACTORIO",3,3,null,null,"UNO",1.9,"NO SATISFACTORIO"]
[2137,null,null,null,11,null,null,11,null,2026,null,null,null,12,null,"2016-01-12",null,null,null,0.12,"NO SATISFACTORIO",4,4,null,null,"UNO",2,"NO SATISFACTORIO"]
[2012,null,null,null,12,null,null,12,null,2027,null,null,null,13,null,"2016-01-13",null,null,null,0.13,"NO SATISFACTORIO",null,5,null,null,"UNO",2.1,"NO SATISFACTORIO"]
[2014,null,"SI",null,13,null,null,13,null,2028,null,null,null,14,null,"2016-01-14",null,null,null,0.14000000000000001,"NO SATISFACTORIO",null,6,null,null,"UNO",2.2000000000000002,"NO SATISFACTORIO"]
[2018,null,"NO",null,14,null,null,14,null,2029,null,null,null,15,null,"2016-01-15",null,null,null,0.15,"NO SATISFACTORIO",null,7,null,null,"UNO",2.2999999999999998,"NO SATISFACTORIO"]
[2003,null,null,null,15,null,null,15,null,2030,null,null,null,16,null,"2016-01-16",null,null,null,0.16,null,null,8,null,null,"UNO",15,"NO SATISFACTORIO"]
[2004,null,null,null,16,null,null,16,null,2031,null,null,null,17,null,"2016-01-17",null,"CONOCIMIENTO DEL ENTORNO",null,0.16,"NO SATISFACTORIO",5,9,null,null,"UNO",2.4,"NO SATISFACTORIO"]
[2085,null,null,null,17,null,null,17,null,2032,null,null,null,18,null,"2016-01-18",null,null,null,0.17,"NO SATISFACTORIO",5.9589041095890396,10,null,null,"UNO",2.5,"NO SATISFACTORIO"]
[2120,null,null,null,18,null,null,18,null,2033,null,null,null,19,null,"2016-01-19",null,"CONSTRUCCIÓN DE RELACIONES",null,0.18,"NO SATISFACTORIO",6.5068493150685001,11,null,null,"UNO",2.6,"NO SATISFACTORIO"]
[2142,null,null,null,19,null,null,19,null,2034,null,null,null,20,null,"2016-01-20",null,null,null,0.19,"NO SATISFACTORIO",7.0547945205479401,12,null,null,"UNO",2.7,"NO SATISFACTORIO"]
[2087,null,null,null,20,null,null,20,null,2035,null,null,null,21,null,"2016-01-21",null,null,null,0.2,"NO SATISFACTORIO",7.6027397260273899,13,null,null,"UNO",2.8,"NO SATISFACTORIO"]
[2123,null,null,null,21,null,null,21,null,2036,null,null,null,22,null,"2016-01-22",null,"INICIATIVA",null,0.21,"NO SATISFACTORIO",8.1506849315068504,14,null,null,"UNO",2.9,"NO SATISFACTORIO"]
[2052,null,null,null,22,null,null,22,null,2037,null,null,null,23,null,"2016-01-23",null,null,null,0.22,"NO SATISFACTORIO",8.6986301369862993,15,null,null,"UNO",3,"NO SATISFACTORIO"]
[2009,null,null,null,23,null,null,23,null,2038,null,null,null,24,null,"2016-01-24",null,null,null,0.23,"NO SATISFACTORIO",9.24657534246575,16,null,null,"UNO",3.1,"NO SATISFACTORIO"]
[2007,null,null,null,24,null,null,24,null,2039,null,65,null,25,null,"2016-01-25",null,null,null,0.24,"NO SATISFACTORIO",9.7945205479452007,17,null,null,"UNO",3.2,"NO SATISFACTORIO"]
[2112,null,null,null,25,null,null,25,null,2040,null,76,null,26,null,"2016-01-26",null,null,null,0.25,"NO SATISFACTORIO",10.342465753424699,18,null,null,"UNO",3.3,"NO SATISFACTORIO"]
[2165,null,null,null,26,null,null,26,null,2042,null,80,null,27,null,"2016-01-27",null,null,null,0.26,"NO SATISFACTORIO",10.8904109589041,19,null,null,"UNO",3.3,"NO SATISFACTORIO"]
[2028,null,null,null,27,null,null,27,null,2043,null,85,null,28,null,"2016-01-28",null,null,null,0.27,"NO SATISFACTORIO",11.438356164383601,20,null,null,"DOS",3.4,"NO SATISFACTORIO"]
[2033,null,null,null,null,null,null,28,null,2044,null,90,null,29,null,"2016-01-29",null,null,null,0.28000000000000003,"NO SATISFACTORIO",11.986301369863,21,null,null,null,3.5,"NO SATISFACTORIO"]
[2044,null,null,null,null,null,null,29,null,2045,null,95,null,30,null,"2016-01-30",null,null,null,0.28999999999999998,"NO SATISFACTORIO",12.534246575342401,22,null,null,null,3.6,"NO SATISFACTORIO"]
[2048,null,null,null,null,null,null,30,null,2046,null,100,null,31,null,"2016-01-31",null,null,null,0.3,"NO SATISFACTORIO",13.082191780821899,23,null,null,null,3.7,"NO SATISFACTORIO"]
[2152,null,null,null,null,null,null,31,null,2047,null,null,null,32,null,"2016-02-01",null,null,null,0.31,"NO SATISFACTORIO",13.6301369863013,24,null,null,null,3.8,"NO SATISFACTORIO"]
[2184,null,null,null,null,null,null,null,null,2048,null,null,null,33,null,"2016-02-02",null,null,null,0.32,"NO SATISFACTORIO",14.178082191780801,25,null,null,null,3.9,"NO SATISFACTORIO"]
[2094,null,null,null,null,null,null,null,null,2049,null,null,null,34,null,"2016-02-03",null,null,null,0.33,"NO SATISFACTORIO",14.7260273972603,26,null,null,null,4,"NO SATISFACTORIO"]
[2186,null,null,null,null,null,null,null,null,2050,null,null,null,35,null,"2016-02-04",null,null,null,0.34,"NO SATISFACTORIO",15.2739726027397,27,null,null,null,4.0999999999999996,"NO SATISFACTORIO"]
[2102,null,null,null,null,null,null,null,null,null,null,null,null,36,null,"2016-02-05",null,null,null,0.35,"NO SATISFACTORIO",15.821917808219199,28,null,null,null,4.2,"NO SATISFACTORIO"]
[2103,null,null,null,null,null,null,null,null,null,null,null,null,37,null,"2016-02-06",null,null,null,0.36,"NO SATISFACTORIO",16.369863013698598,29,null,null,null,4.3,"NO SATISFACTORIO"]
[2114,null,null,null,null,null,null,null,null,null,null,null,null,38,null,"2016-02-07",null,null,null,0.37,"NO SATISFACTORIO",16.917808219178099,30,null,null,null,4.4000000000000004,"NO SATISFACTORIO"]
[2147,null,null,null,null,null,null,null,null,null,null,null,null,39,null,"2016-02-08",null,null,null,0.38,"NO SATISFACTORIO",17.4657534246575,31,null,null,null,4.5,"NO SATISFACTORIO"]
[2116,null,null,null,null,null,null,null,null,null,null,null,null,40,null,"2016-02-09",null,null,null,0.39,"NO SATISFACTORIO",18.013698630137,32,null,null,null,4.5999999999999996,"NO SATISFACTORIO"]
[3003,null,null,null,null,null,null,null,null,null,null,null,null,41,null,"2016-02-10",null,null,null,0.4,"NO SATISFACTORIO",18.561643835616401,33,null,null,null,4.7,"NO SATISFACTORIO"]
[3038,null,null,null,null,null,null,null,null,null,null,null,null,42,null,"2016-02-11",null,null,null,0.41,"NO SATISFACTORIO",19.109589041095902,34,null,null,null,4.8,"NO SATISFACTORIO"]
[3046,null,null,null,null,null,null,null,null,null,null,null,null,43,null,"2016-02-12",null,null,null,0.42,"NO SATISFACTORIO",19.657534246575299,35,null,null,null,4.9000000000000004,"NO SATISFACTORIO"]
[3054,null,null,null,null,null,null,null,null,null,null,null,null,44,null,"2016-02-13",null,null,null,0.43,"NO SATISFACTORIO",20.205479452054799,36,null,null,null,5,"NO SATISFACTORIO"]
[3066,null,null,null,null,null,null,null,null,null,null,null,null,45,null,"2016-02-14",null,null,null,0.44,"NO SATISFACTORIO",20.7534246575342,37,null,null,null,5.0999999999999996,"NO SATISFACTORIO"]
[3066,null,null,null,null,null,null,null,null,null,null,null,null,46,null,"2016-02-15",null,null,null,0.45,"NO SATISFACTORIO",21.301369863013701,38,null,null,null,5.6,"NO SATISFACTORIO"]
[3074,null,null,null,null,null,null,null,null,null,null,null,null,47,null,"2016-02-16",null,null,null,0.46,"NO SATISFACTORIO",21.849315068493102,39,null,null,null,5.7,"NO SATISFACTORIO"]
[3078,null,null,null,null,null,null,null,null,null,null,null,null,48,null,"2016-02-17",null,null,null,0.47,"NO SATISFACTORIO",22.397260273972599,40,null,null,null,5.8,"NO SATISFACTORIO"]
[3080,null,null,null,null,null,null,null,null,null,null,null,null,49,null,"2016-02-18",null,null,null,0.48,"NO SATISFACTORIO",22.945205479452,41,null,null,null,5.9,"NO SATISFACTORIO"]
[3084,null,null,null,null,null,null,null,null,null,null,null,null,50,null,"2016-02-19",null,null,null,0.49,"NO SATISFACTORIO",23.4931506849315,42,null,null,null,6,"NO SATISFACTORIO"]
[3092,null,null,null,null,null,null,null,null,null,null,null,null,51,null,"2016-02-20",null,null,null,0.5,"NO SATISFACTORIO",24.041095890410901,43,null,null,null,6.1,"NO SATISFACTORIO"]
[3094,null,null,null,null,null,null,null,null,null,null,null,null,52,null,"2016-02-21",null,null,null,0.51,"NO SATISFACTORIO",24.589041095890401,44,null,null,null,6.2,"NO SATISFACTORIO"]
[3070,null,null,null,null,null,null,null,null,null,null,null,null,53,null,"2016-02-22",null,null,null,0.52,"NO SATISFACTORIO",null,45,null,null,null,6.3,"NO SATISFACTORIO"]
[3102,null,null,null,null,null,null,null,null,null,null,null,null,54,null,"2016-02-23",null,null,null,0.53,"NO SATISFACTORIO",null,46,null,null,"TRES",6.4,"NO SATISFACTORIO"]
[3105,null,null,null,null,null,null,null,null,null,null,null,null,55,null,"2016-02-24",null,null,null,0.54,"NO SATISFACTORIO",null,47,null,null,null,6.5,"NO SATISFACTORIO"]
[3110,null,null,null,null,null,null,null,null,null,null,null,null,56,null,"2016-02-25",null,null,null,0.55000000000000004,"NO SATISFACTORIO",null,48,null,null,null,6.6,"NO SATISFACTORIO"]
[3116,null,null,null,null,null,null,null,null,null,null,null,null,57,null,"2016-02-26",null,null,null,0.56000000000000005,"NO SATISFACTORIO",null,49,null,null,null,6.7,"NO SATISFACTORIO"]
[3118,null,null,null,null,null,null,null,null,null,null,null,null,58,null,"2016-02-27",null,null,null,0.56999999999999995,"NO SATISFACTORIO",null,50,null,null,null,6.8,"NO SATISFACTORIO"]
[3100,null,null,null,null,null,null,null,null,null,null,null,null,59,null,"2016-02-28",null,null,null,0.57999999999999996,"NO SATISFACTORIO",null,51,null,null,null,6.9,"NO SATISFACTORIO"]
[3124,null,null,null,null,null,null,null,null,null,null,null,null,60,null,"2016-02-29",null,null,null,0.59,"NO SATISFACTORIO",null,52,null,null,null,7,"NO SATISFACTORIO"]
[3234,null,null,null,null,null,null,null,null,null,null,null,null,61,null,"2016-03-01",null,null,null,0.6,"NO SATISFACTORIO",null,53,null,null,null,7.1,"NO SATISFACTORIO"]
[3128,null,null,null,null,null,null,null,null,null,null,null,null,62,null,"2016-03-02",null,null,null,0.61,"NO SATISFACTORIO",null,54,null,null,null,7.2,"NO SATISFACTORIO"]
[3132,null,null,null,null,null,null,null,null,null,null,null,null,63,null,"2016-03-03",null,null,null,0.62,"NO SATISFACTORIO",null,55,null,null,null,7.3,"NO SATISFACTORIO"]
[3136,null,null,null,null,null,null,null,null,null,null,null,null,64,null,"2016-03-04",null,null,null,0.63,"NO SATISFACTORIO",null,56,null,null,null,7.4,"NO SATISFACTORIO"]
[3142,null,null,null,null,null,null,null,null,null,null,null,null,65,null,"2016-03-05",null,null,null,0.64,"NO SATISFACTORIO",null,57,null,null,null,7.5,"NO SATISFACTORIO"]
[3142,null,null,null,null,null,null,null,null,null,null,null,null,66,null,"2016-03-06",null,null,null,0.65010000000000001,"SATISFACTORIO",null,58,null,null,null,7.6,"NO SATISFACTORIO"]
[3142,null,null,null,null,null,null,null,null,null,null,null,null,67,null,"2016-03-07",null,null,null,0.66,"SATISFACTORIO",null,59,null,null,null,7.7,"NO SATISFACTORIO"]
[3142,null,null,null,null,null,null,null,null,null,null,null,null,68,null,"2016-03-08",null,null,null,0.67,"SATISFACTORIO",null,60,null,null,null,7.8,"NO SATISFACTORIO"]
[3142,null,null,null,null,null,null,null,null,null,null,null,null,69,null,"2016-03-09",null,null,null,0.68,"SATISFACTORIO",null,61,null,null,null,7.9,"NO SATISFACTORIO"]
[4002,null,null,null,null,null,null,null,null,null,null,null,null,70,null,"2016-03-10",null,null,null,0.69,"SATISFACTORIO",null,62,null,null,null,8,"NO SATISFACTORIO"]
[4006,null,null,null,null,null,null,null,null,null,null,null,null,71,null,"2016-03-11",null,null,null,0.7,"SATISFACTORIO",null,63,null,null,null,8.1,"NO SATISFACTORIO"]
[4008,null,null,null,null,null,null,null,null,null,null,null,null,72,null,"2016-03-12",null,null,null,0.71,"SATISFACTORIO",null,64,null,null,null,8.1999999999999993,"NO SATISFACTORIO"]
[4026,null,null,null,null,null,null,null,null,null,null,null,null,73,null,"2016-03-13",null,null,null,0.72,"SATISFACTORIO",null,65,null,null,null,8.3000000000000007,"NO SATISFACTORIO"]
[4028,null,null,null,null,null,null,null,null,null,null,null,null,74,null,"2016-03-14",null,null,null,0.73,"SATISFACTORIO",null,66,null,null,null,8.4,"NO SATISFACTORIO"]
[4032,null,null,null,null,null,null,null,null,null,null,null,null,75,null,"2016-03-15",null,null,null,0.74,"SATISFACTORIO",null,67,null,null,null,8.5,"NO SATISFACTORIO"]
[4034,null,null,null,null,null,null,null,null,null,null,null,null,76,null,"2016-03-16",null,null,null,0.75,"SATISFACTORIO",null,68,null,null,null,8.6,"NO SATISFACTORIO"]
[4036,null,null,null,null,null,null,null,null,null,null,null,null,77,null,"2016-03-17",null,null,null,0.76,"SATISFACTORIO",null,69,null,null,null,8.6999999999999993,"NO SATISFACTORIO"]
[4038,null,null,null,null,null,null,null,null,null,null,null,null,78,null,"2016-03-18",null,null,null,0.77,"SATISFACTORIO",null,70,null,null,null,8.9,"NO SATISFACTORIO"]
[4044,null,null,null,null,null,null,null,null,null,null,null,null,79,null,"2016-03-19",null,null,null,0.78,"SATISFACTORIO",null,71,null,null,null,9,"NO SATISFACTORIO"]
[4048,null,null,null,null,null,null,null,null,null,null,null,null,80,null,"2016-03-20",null,null,null,0.79,"SATISFACTORIO",null,72,null,null,"CUATRO",9.1,"NO SATISFACTORIO"]
[4056,null,null,null,null,null,null,null,null,null,null,null,null,81,null,"2016-03-21",null,null,null,0.8,"DESTACADO",null,73,null,null,null,9.1999999999999993,"NO SATISFACTORIO"]
[4064,null,null,null,null,null,null,null,null,null,null,null,null,82,null,"2016-03-22",null,null,null,0.81,"DESTACADO",null,74,null,null,null,9.3000000000000007,"NO SATISFACTORIO"]
[4069,null,null,null,null,null,null,null,null,null,null,null,null,83,null,"2016-03-23",null,null,null,0.82,"DESTACADO",null,75,null,null,null,9.4,"NO SATISFACTORIO"]
[4078,null,null,null,null,null,null,null,null,null,null,null,null,84,null,"2016-03-24",null,null,null,0.83,"DESTACADO",null,76,null,null,null,9.5,"NO SATISFACTORIO"]
[4097,null,null,null,null,null,null,null,null,null,null,null,null,85,null,"2016-03-25",null,null,null,0.84,"DESTACADO",null,77,null,null,null,9.6,"NO SATISFACTORIO"]
[4097,null,null,null,null,null,null,null,null,null,null,null,null,86,null,"2016-03-26",null,null,null,0.85,"DESTACADO",null,78,null,null,null,9.6999999999999993,"NO SATISFACTORIO"]
[4097,null,null,null,null,null,null,null,null,null,null,null,null,87,null,"2016-03-27",null,null,null,0.86,"DESTACADO",null,79,null,null,null,9.8000000000000007,"NO SATISFACTORIO"]
[4097,null,null,null,null,null,null,null,null,null,null,null,null,88,null,"2016-03-28",null,null,null,0.87,"DESTACADO",null,80,null,null,null,9.9,"NO SATISFACTORIO"]
[4097,null,null,null,null,null,null,null,null,null,null,null,null,89,null,"2016-03-29",null,null,null,0.88,"DESTACADO",null,81,null,null,null,10,"NO SATISFACTORIO"]
[4103,null,null,null,null,null,null,null,null,null,null,null,null,90,null,"2016-03-30",null,null,null,0.89,"DESTACADO",null,82,null,null,null,10.1,"NO SATISFACTORIO"]
[4112,null,null,null,null,null,null,null,null,null,null,null,null,91,null,"2016-03-31",null,null,null,0.9,"DESTACADO",null,83,null,null,null,10.199999999999999,"NO SATISFACTORIO"]
[4114,null,null,null,null,null,null,null,null,null,null,null,null,92,null,"2016-04-01",null,null,null,0.91,"DESTACADO",null,84,null,null,null,10.3,"NO SATISFACTORIO"]
[4123,null,null,null,null,null,null,null,null,null,null,null,null,93,null,"2016-04-02",null,null,null,0.93,"DESTACADO",null,85,null,null,null,10.4,"NO SATISFACTORIO"]
[4128,null,null,null,null,null,null,null,null,null,null,null,null,94,null,"2016-04-03",null,null,null,0.94,"DESTACADO",null,86,null,null,null,10.5,"NO SATISFACTORIO"]
[4137,null,null,null,null,null,null,null,null,null,null,null,null,95,null,"2016-04-04",null,null,null,0.95,"SOBRESALIENTE",null,87,null,null,null,10.6,"NO SATISFACTORIO"]
[4152,null,null,null,null,null,null,null,null,null,null,null,null,96,null,"2016-04-05",null,null,null,0.96,"SOBRESALIENTE",null,88,null,null,null,10.7,"NO SATISFACTORIO"]
[4158,null,null,null,null,null,null,null,null,null,null,null,null,97,null,"2016-04-06",null,null,null,0.97,"SOBRESALIENTE",null,89,null,null,null,10.8,"NO SATISFACTORIO"]
[4167,null,null,null,null,null,null,null,null,null,null,null,null,98,null,"2016-04-07",null,null,null,0.98,"SOBRESALIENTE",null,90,null,null,null,10.9,"NO SATISFACTORIO"]
[4169,null,null,null,null,null,null,null,null,null,null,null,null,99,null,"2016-04-08",null,null,null,0.99,"SOBRESALIENTE",null,91,null,null,null,11,"NO SATISFACTORIO"]
[4173,null,null,null,null,null,null,null,null,null,null,null,null,100,null,"2016-04-09",null,null,null,1,"SOBRESALIENTE",null,92,null,null,null,11.1,"NO SATISFACTORIO"]
[4178,null,null,null,null,null,null,null,null,null,null,null,null,null,null,"2016-04-10",null,null,null,1.01,"SOBRESALIENTE",null,93,null,null,null,11.2,"NO SATISFACTORIO"]
[4182,null,null,null,null,null,null,null,null,null,null,null,null,0.98,null,"2016-04-11",null,null,null,null,null,null,94,null,null,null,11.3,"NO SATISFACTORIO"]
[4210,null,null,null,null,null,null,null,null,null,null,null,null,0.99,null,"2016-04-12",null,null,null,null,null,null,95,null,null,null,11.4,"NO SATISFACTORIO"]
[4212,null,null,null,null,null,null,null,null,null,null,null,null,1,null,"2016-04-13",null,null,null,null,null,null,96,null,null,null,11.5,"NO SATISFACTORIO"]
[4215,null,null,null,null,null,null,null,null,null,null,null,null,null,null,"2016-04-14",null,null,null,null,null,null,97,null,null,null,11.6,"NO SATISFACTORIO"]
[4220,null,null,null,null,null,null,null,null,null,null,null,null,null,null,"2016-04-15",null,null,null,null,null,null,98,null,null,"CINCO",11.7,"NO SATISFACTORIO"]
[4222,null,null,null,null,null,null,null,null,null,null,null,null,null,null,"2016-04-16",null,null,null,null,null,null,99,null,null,null,11.8,"NO SATISFACTORIO"]
[4225,null,null,null,null,null,null,null,null,null,null,null,null,null,null,"2016-04-17",null,null,null,null,null,null,100,null,null,null,11.9,"NO SATISFACTORIO"]
[4225,null,null,null,null,null,null,null,null,null,null,null,null,null,null,"2016-04-18",null,null,null,null,null,null,101,null,null,null,12,"NO SATISFACTORIO"]
[null,null,null,null,null,null,null,null,null,null,null,null,null,null,null,"2016-04-19",null,null,null,null,null,null,102,null,null,null,12.1,"NO SATISFACTORIO"]
[null,null,null,null,null,null,null,null,null,null,null,null,null,null,null,"2016-04-20",null,null,null,null,null,null,103,null,null,null,12.2,"NO SATISFACTORIO"]
["Agregado para Asuntos Aéreos",null,null,null,null,null,null,null,null,null,null,null,null,null,null,"2016-04-21",null,null,null,null,null,null,104,null,null,null,12.3,"NO SATISFACTORIO"]
["Asesor",null,null,null,null,null,null,null,null,null,null,null,null,null,null,"2016-04-22",null,null,null,null,null,null,105,null,null,null,12.4,"NO SATISFACTORIO"]
["Asesor Comercial",null,null,null,null,null,null,null,null,null,null,null,null,null,null,"2016-04-23",null,null,null,null,null,null,106,null,null,null,12.5,"NO SATISFACTORIO"]
["Jefe de Oficina Asesora de Comunicaciones o de Prensa o de Jurídica o de Planeación",null,null,null,null,null,null,null,null,null,null,null,null,null,null,"2016-04-24",null,null,null,null,null,null,107,null,null,null,12.6,"NO SATISFACTORIO"]
["Administrador de Parques Nacionales",null,null,null,null,null,null,null,null,null,null,null,null,null,null,"2016-04-25",null,null,null,null,null,null,108,null,null,null,12.7,"NO SATISFACTORIO"]
["Jefe de Área protegida",null,null,null,null,null,null,null,null,null,null,null,null,null,null,"2016-04-26",null,null,null,null,null,null,109,null,null,null,12.8,"NO SATISFACTORIO"]
["Capellán",null,null,null,null,null,null,null,null,null,null,null,null,null,null,"2016-04-27",null,null,null,null,null,null,110,null,null,null,12.9,"NO SATISFACTORIO"]
["Comandante Superior de Prisiones",null,null,null,null,null,null,null,null,null,null,null,null,null,null,"2016-04-28",null,null,null,null,null,null,111,null,null,null,13,"NO SATISFACTORIO"]
["Consejero de Relaciones Exteriores",null,null,null,null,null,null,null,null,null,null,null,null,null,null,"2016-04-29",null,null,null,null,null,null,112,null,null,null,13.1,"NO SATISFACTORIO"]
["Copiloto de Aviación",null,null,null,null,null,null,null,null,null,null,null,null,null,null,"2016-04-30",null,null,null,null,null,null,113,null,null,null,13.2,"NO SATISFACTORIO"]
["Defensor de Familia",null,null,null,null,null,null,null,null,null,null,null,null,null,null,"2016-05-01",null,null,null,null,null,null,114,null,null,null,13.3,"NO SATISFACTORIO"]
["Director de Establecimiento Carcelario",null,null,null,null,null,null,null,null,null,null,null,null,null,null,"2016-05-02",null,null,null,null,null,null,115,null,null,null,13.4,"NO SATISFACTORIO"]
["Especialista Asesor Primero",null,null,null,null,null,null,null,null,null,null,null,null,null,null,"2016-05-03",null,null,null,null,null,null,116,null,null,null,13.5,"NO SATISFACTORIO"]
["Especialista Jefe",null,null,null,null,null,null,null,null,null,null,null,null,null,null,"2016-05-04",null,null,null,null,null,null,117,null,null,null,13.6,"NO SATISFACTORIO"]
["Inspector de Trabajo y Seguridad Social",null,null,null,null,null,null,null,null,null,null,null,null,null,null,"2016-05-05",null,null,null,null,null,null,118,null,null,null,13.7,"NO SATISFACTORIO"]
["Inspector de Trabajo y Seguridad Social Especializado",null,null,null,null,null,null,null,null,null,null,null,null,null,null,"2016-05-06",null,null,null,null,null,null,119,null,null,null,13.8,"NO SATISFACTORIO"]
["Médico",null,null,null,null,null,null,null,null,null,null,null,null,null,null,"2016-05-07",null,null,null,null,null,null,120,null,null,null,13.9,"NO SATISFACTORIO"]
["Médico Especialista",null,null,null,null,null,null,null,null,null,null,null,null,null,null,"2016-05-08",null,null,null,null,null,null,121,null,null,null,14,"NO SATISFACTORIO"]
["Odontólogo",null,null,null,null,null,null,null,null,null,null,null,null,null,null,"2016-05-09",null,null,null,null,null,null,122,null,null,null,14.1,"NO SATISFACTORIO"]
["Odontólogo Especialista",null,null,null,null,null,null,null,null,null,null,null,null,null,null,"2016-05-10",null,null,null,null,null,null,123,null,null,null,14.2,"NO SATISFACTORIO"]
["Oficial Logístico",null,null,null,null,null,null,null,null,null,null,null,null,null,null,"2016-05-11",null,null,null,null,null,null,124,null,null,"SEIS",14.3,"NO SATISFACTORIO"]
["Oficial de Tratamiento Penitenciario",null,null,null,null,null,null,null,null,null,null,null,null,null,null,"2016-05-12",null,null,null,null,null,null,125,null,null,null,14.4,"NO SATISFACTORIO"]
["Pastor u Orientador Espiritual",null,null,null,null,null,null,null,null,null,null,null,null,null,null,"2016-05-13",null,null,null,null,null,null,126,null,null,null,14.5,"NO SATISFACTORIO"]
["Piloto de Aviación",null,null,null,null,null,null,null,null,null,null,null,null,null,null,"2016-05-14",null,null,null,null,null,null,127,null,null,null,14.6,"NO SATISFACTORIO"]
["Primer Secretario de Relaciones Exteriores",null,null,null,null,null,null,null,null,null,null,null,null,null,null,"2016-05-15",null,null,null,null,null,null,128,null,null,null,14.7,"NO SATISFACTORIO"]
["Profesional de Gestión Institucional",null,null,null,null,null,null,null,null,null,null,null,null,null,null,"2016-05-16",null,null,null,null,null,null,129,null,null,null,14.8,"NO SATISFACTORIO"]
["Profesional de Gestión Institucional",null,null,null,null,null,null,null,null,null,null,null,null,null,null,"2016-05-17",null,null,null,null,null,null,130,null,null,null,14.9,"NO SATISFACTORIO"]
["Profesional Especializado",null,null,null,null,null,null,null,null,null,null,null,null,null,null,"2016-05-18",null,null,null,null,null,null,131,null,null,null,15,"NO SATISFACTORIO"]
["Profesional Especializado Area de la Salud",null,null,null,null,null,null,null,null,null,null,null,null,null,null,"2016-05-19",null,null,null,null,null,null,132,null,null,null,15.1,"NO SATISFACTORIO"]
["Profesional Universitario",null,null,null,null,null,null,null,null,null,null,null,null,null,null,"2016-05-20",null,null,null,null,null,null,133,null,null,null,15.2,"NO SATISFACTORIO"]
["Profesional Universitario Area de la Salud",null,null,null,null,null,null,null,null,null,null,null,null,null,null,"2016-05-21",null,null,null,null,null,null,134,null,null,null,15.3,"NO SATISFACTORIO"]
["Registrador Delegado",null,null,null,null,null,null,null,null,null,null,null,null,null,null,"2016-05-22",null,null,null,null,null,null,135,null,null,null,15.4,"NO SATISFACTORIO"]
["Registrador Seccional",null,null,null,null,null,null,null,null,null,null,null,null,null,null,"2016-05-23",null,null,null,null,null,null,136,null,null,null,15.5,"NO SATISFACTORIO"]
["Representante del Ministro de Educación ante Entidad Territorial",null,null,null,null,null,null,null,null,null,null,null,null,null,null,"2016-05-24",null,null,null,null,null,null,137,null,null,null,15.6,"NO SATISFACTORIO"]
["Restaurador o Museólogo o Curador",null,null,null,null,null,null,null,null,null,null,null,null,null,null,"2016-05-25",null,null,null,null,null,null,138,null,null,null,15.7,"NO SATISFACTORIO"]
["Secretario de Facultad",null,null,null,null,null,null,null,null,null,null,null,null,null,null,"2016-05-26",null,null,null,null,null,null,139,null,null,null,15.8,"NO SATISFACTORIO"]
["Secretario Comercial I",null,null,null,null,null,null,null,null,null,null,null,null,null,null,"2016-05-27",null,null,null,null,null,null,140,null,null,null,15.9,"NO SATISFACTORIO"]
["Secretario Comercial II",null,null,null,null,null,null,null,null,null,null,null,null,null,null,"2016-05-28",null,null,null,null,null,null,141,null,null,null,16,"NO SATISFACTORIO"]
["Segundo Secretario de Relaciones Exteriores",null,null,null,null,null,null,null,null,null,null,null,null,null,null,"2016-05-29",null,null,null,null,null,null,142,null,null,null,16.100000000000001,"NO SATISFACTORIO"]
["Subdirector de Establecimiento Carcelario",null,null,null,null,null,null,null,null,null,null,null,null,null,null,"2016-05-30",null,null,null,null,null,null,143,null,null,null,16.2,"NO SATISFACTORIO"]
["Tercer Secretario de Relaciones Exteriores",null,null,null,null,null,null,null,null,null,null,null,null,null,null,"2016-05-31",null,null,null,null,null,null,144,null,null,null,16.3,"NO SATISFACTORIO"]
["Analista de Sistemas",null,null,null,null,null,null,null,null,null,null,null,null,null,null,"2016-06-01",null,null,null,null,null,null,145,null,null,null,16.399999999999999,"NO SATISFACTORIO"]
["Auxiliar de Escena",null,null,null,null,null,null,null,null,null,null,null,null,null,null,"2016-06-02",null,null,null,null,null,null,146,null,null,null,16.5,"NO SATISFACTORIO"]
["Auxiliar de Pronóstico",null,null,null,null,null,null,null,null,null,null,null,null,null,null,"2016-06-03",null,null,null,null,null,null,147,null,null,null,16.600000000000001,"NO SATISFACTORIO"]
["Auxiliar de Técnico",null,null,null,null,null,null,null,null,null,null,null,null,null,null,"2016-06-04",null,null,null,null,null,null,148,null,null,null,16.7,"NO SATISFACTORIO"]
["Dactiloscopista",null,null,null,null,null,null,null,null,null,null,null,null,null,null,"2016-06-05",null,null,null,null,null,null,149,null,null,null,16.8,"NO SATISFACTORIO"]
["Tecnico",null,null,null,null,null,null,null,null,null,null,null,null,null,null,"2016-06-06",null,null,null,null,null,null,150,null,null,"SIETE",16.899999999999999,"NO SATISFACTORIO"]
["Especialista Primero",null,null,null,null,null,null,null,null,null,null,null,null,null,null,"2016-06-07",null,null,null,null,null,null,151,null,null,null,17,"NO SATISFACTORIO"]
["Especialista Segundo",null,null,null,null,null,null,null,null,null,null,null,null,null,null,"2016-06-08",null,null,null,null,null,null,152,null,null,null,17.100000000000001,"NO SATISFACTORIO"]
["Especialista Tercero",null,null,null,null,null,null,null,null,null,null,null,null,null,null,"2016-06-09",null,null,null,null,null,null,153,null,null,null,17.2,"NO SATISFACTORIO"]
["Especialista Cuarto",null,null,null,null,null,null,null,null,null,null,null,null,null,null,"2016-06-10",null,null,null,null,null,null,154,null,null,null,17.3,"NO SATISFACTORIO"]
["Especialista Quinto",null,null,null,null,null,null,null,null,null,null,null,null,null,null,"2016-06-11",null,null,null,null,null,null,155,null,null,null,17.399999999999999,"NO SATISFACTORIO"]
["Especialista Sexto",null,null,null,null,null,null,null,null,null,null,null,null,null,null,"2016-06-12",null,null,null,null,null,null,156,null,null,null,17.5,"NO SATISFACTORIO"]
["Instructor",null,null,null,null,null,null,null,null,null,null,null,null,null,null,"2016-06-13",null,null,null,null,null,null,157,null,null,null,17.600000000000001,"NO SATISFACTORIO"]
["Instrumentador Quirúrgico",null,null,null,null,null,null,null,null,null,null,null,null,null,null,"2016-06-14",null,null,null,null,null,null,158,null,null,null,17.7,"NO SATISFACTORIO"]
["Observador de Superficie",null,null,null,null,null,null,null,null,null,null,null,null,null,null,"2016-06-15",null,null,null,null,null,null,159,null,null,null,17.8,"NO SATISFACTORIO"]
["Oficial de Catastro",null,null,null,null,null,null,null,null,null,null,null,null,null,null,"2016-06-16",null,null,null,null,null,null,160,null,null,null,17.899999999999999,"NO SATISFACTORIO"]
["Pronosticador",null,null,null,null,null,null,null,null,null,null,null,null,null,null,"2016-06-17",null,null,null,null,null,null,161,null,null,null,18,"NO SATISFACTORIO"]
["Radiosondista",null,null,null,null,null,null,null,null,null,null,null,null,null,null,"2016-06-18",null,null,null,null,null,null,162,null,null,null,18.100000000000001,"NO SATISFACTORIO"]
["Técnico",null,null,null,null,null,null,null,null,null,null,null,null,null,null,"2016-06-19",null,null,null,null,null,null,163,null,null,null,18.2,"NO SATISFACTORIO"]
["Técnico Administrativo",null,null,null,null,null,null,null,null,null,null,null,null,null,null,"2016-06-20",null,null,null,null,null,null,164,null,null,null,18.3,"NO SATISFACTORIO"]
["Técnico Area Salud",null,null,null,null,null,null,null,null,null,null,null,null,null,null,"2016-06-21",null,null,null,null,null,null,165,null,null,null,18.399999999999999,"NO SATISFACTORIO"]
["Técnico de Servicios Asistenciales",null,null,null,null,null,null,null,null,null,null,null,null,null,null,"2016-06-22",null,null,null,null,null,null,166,null,null,null,18.5,"NO SATISFACTORIO"]
["Técnico Operativo",null,null,null,null,null,null,null,null,null,null,null,null,null,null,"2016-06-23",null,null,null,null,null,null,167,null,null,null,18.600000000000001,"NO SATISFACTORIO"]
["Topógrafo",null,null,null,null,null,null,null,null,null,null,null,null,null,null,"2016-06-24",null,null,null,null,null,null,168,null,null,null,18.7,"NO SATISFACTORIO"]
["Topógrafo Tecnólogo",null,null,null,null,null,null,null,null,null,null,null,null,null,null,"2016-06-25",null,null,null,null,null,null,169,null,null,null,18.8,"NO SATISFACTORIO"]
["Adjunto Jefe",null,null,null,null,null,null,null,null,null,null,null,null,null,null,"2016-06-26",null,null,null,null,null,null,170,null,null,null,18.899999999999999,"NO SATISFACTORIO"]
["Adjunto Intendente",null,null,null,null,null,null,null,null,null,null,null,null,null,null,"2016-06-27",null,null,null,null,null,null,171,null,null,null,19,"NO SATISFACTORIO"]
["Adjunto Mayor",null,null,null,null,null,null,null,null,null,null,null,null,null,null,"2016-06-28",null,null,null,null,null,null,172,null,null,null,19.100000000000001,"NO SATISFACTORIO"]
["Adjunto Especial",null,null,null,null,null,null,null,null,null,null,null,null,null,null,"2016-06-29",null,null,null,null,null,null,173,null,null,null,19.2,"NO SATISFACTORIO"]
["Adjunto Primero",null,null,null,null,null,null,null,null,null,null,null,null,null,null,"2016-06-30",null,null,null,null,null,null,174,null,null,null,19.3,"NO SATISFACTORIO"]
["Adjunto Segundo",null,null,null,null,null,null,null,null,null,null,null,null,null,null,"2016-07-01",null,null,null,null,null,null,175,null,null,null,19.399999999999999,"NO SATISFACTORIO"]
["Adjunto Tercero",null,null,null,null,null,null,null,null,null,null,null,null,null,null,"2016-07-02",null,null,null,null,null,null,176,null,null,"OCHO",19.5,"NO SATISFACTORIO"]
["Adjunto Cuarto",null,null,null,null,null,null,null,null,null,null,null,null,null,null,"2016-07-03",null,null,null,null,null,null,177,null,null,null,19.600000000000001,"NO SATISFACTORIO"]
["Adjunto Quinto",null,null,null,null,null,null,null,null,null,null,null,null,null,null,"2016-07-04",null,null,null,null,null,null,178,null,null,null,19.7,"NO SATISFACTORIO"]
["Auxiliar Administrativo",null,null,null,null,null,null,null,null,null,null,null,null,null,null,"2016-07-05",null,null,null,null,null,null,179,null,null,null,19.8,"NO SATISFACTORIO"]
["Auxiliar Area Salud",null,null,null,null,null,null,null,null,null,null,null,null,null,null,"2016-07-06",null,null,null,null,null,null,180,null,null,null,19.899999999999999,"NO SATISFACTORIO"]
["Auxiliar Bilingüe",null,null,null,null,null,null,null,null,null,null,null,null,null,null,"2016-07-07",null,null,null,null,null,null,181,null,null,null,20,"NO SATISFACTORIO"]
["Auxiliar de Servicios Asistenciales",null,null,null,null,null,null,null,null,null,null,null,null,null,null,"2016-07-08",null,null,null,null,null,null,182,null,null,null,20.100000000000001,"NO SATISFACTORIO"]
["Auxiliar de Servicios Generales",null,null,null,null,null,null,null,null,null,null,null,null,null,null,"2016-07-09",null,null,null,null,null,null,183,null,null,null,20.2,"NO SATISFACTORIO"]
["Capitán de Prisiones",null,null,null,null,null,null,null,null,null,null,null,null,null,null,"2016-07-10",null,null,null,null,null,null,184,null,null,null,20.3,"NO SATISFACTORIO"]
["Celador",null,null,null,null,null,null,null,null,null,null,null,null,null,null,"2016-07-11",null,null,null,null,null,null,185,null,null,null,20.399999999999999,"NO SATISFACTORIO"]
["Asistencial",null,null,null,null,null,null,null,null,null,null,null,null,null,null,"2016-07-12",null,null,null,null,null,null,186,null,null,null,20.5,"NO SATISFACTORIO"]
["Conductor Mecánico",null,null,null,null,null,null,null,null,null,null,null,null,null,null,"2016-07-13",null,null,null,null,null,null,187,null,null,null,20.6,"NO SATISFACTORIO"]
["Distinguido",null,null,null,null,null,null,null,null,null,null,null,null,null,null,"2016-07-14",null,null,null,null,null,null,188,null,null,null,20.7,"NO SATISFACTORIO"]
["Dragoneante",null,null,null,null,null,null,null,null,null,null,null,null,null,null,"2016-07-15",null,null,null,null,null,null,189,null,null,null,20.8,"NO SATISFACTORIO"]
["Ecónomo",null,null,null,null,null,null,null,null,null,null,null,null,null,null,"2016-07-16",null,null,null,null,null,null,190,null,null,null,20.9,"NO SATISFACTORIO"]
["Enfermero Auxiliar",null,null,null,null,null,null,null,null,null,null,null,null,null,null,"2016-07-17",null,null,null,null,null,null,191,null,null,null,21,"NO SATISFACTORIO"]
["Inspector",null,null,null,null,null,null,null,null,null,null,null,null,null,null,"2016-07-18",null,null,null,null,null,null,192,null,null,null,21.1,"NO SATISFACTORIO"]
["Inspector Jefe",null,null,null,null,null,null,null,null,null,null,null,null,null,null,"2016-07-19",null,null,null,null,null,null,193,null,null,null,21.2,"NO SATISFACTORIO"]
["Mayor de Prisiones",null,null,null,null,null,null,null,null,null,null,null,null,null,null,"2016-07-20",null,null,null,null,null,null,194,null,null,null,21.3,"NO SATISFACTORIO"]
["Operario",null,null,null,null,null,null,null,null,null,null,null,null,null,null,"2016-07-21",null,null,null,null,null,null,195,null,null,null,21.4,"NO SATISFACTORIO"]
["Operario Calificado",null,null,null,null,null,null,null,null,null,null,null,null,null,null,"2016-07-22",null,null,null,null,null,null,196,null,null,null,21.5,"NO SATISFACTORIO"]
["Pagador",null,null,null,null,null,null,null,null,null,null,null,null,null,null,"2016-07-23",null,null,null,null,null,null,197,null,null,null,21.6,"NO SATISFACTORIO"]
["Secretario",null,null,null,null,null,null,null,null,null,null,null,null,null,null,"2016-07-24",null,null,null,null,null,null,198,null,null,null,21.7,"NO SATISFACTORIO"]
["Secretario Bilingüe",null,null,null,null,null,null,null,null,null,null,null,null,null,null,"2016-07-25",null,null,null,null,null,null,199,null,null,null,21.8,"NO SATISFACTORIO"]
["Secretario Ejecutivo",null,null,null,null,null,null,null,null,null,null,null,null,null,null,"2016-07-26",null,null,null,null,null,null,200,null,null,null,21.9,"NO SATISFACTORIO"]
["Secretario Ejecutivo del Despacho de Ministro o de Director de Departamento Administrativo",null,null,null,null,null,null,null,null,null,null,null,null,null,null,"2016-07-27",null,null,null,null,null,null,201,null,null,null,22,"NO SATISFACTORIO"]
["Secretario Ejecutivo del Despacho del Viceministro o de Subdirector de Departamento Administrativo",null,null,null,null,null,null,null,null,null,null,null,null,null,null,"2016-07-28",null,null,null,null,null,null,202,null,null,"NUEVE",22.1,"NO SATISFACTORIO"]
["Supervisor",null,null,null,null,null,null,null,null,null,null,null,null,null,null,"2016-07-29",null,null,null,null,null,null,203,null,null,null,22.2,"NO SATISFACTORIO"]
["Teniente de Prisiones",null,null,null,null,null,null,null,null,null,null,null,null,null,null,"2016-07-30",null,null,null,null,null,null,204,null,null,null,22.3,"NO SATISFACTORIO"]
["Tesorero",null,null,null,null,null,null,null,null,null,null,null,null,null,null,"2016-07-31",null,null,null,null,null,null,205,null,null,null,22.4,"NO SATISFACTORIO"]
[null,null,null,null,null,null,null,null,null,null,null,null,null,null,null,"2016-08-01",null,null,null,null,null,null,206,null,null,null,22.5,"NO SATISFACTORIO"]
[null,null,null,null,null,null,null,null,null,null,null,null,null,null,null,"2016-08-02",null,null,null,null,null,null,207,null,null,null,22.6,"NO SATISFACTORIO"]
[null,null,null,null,null,null,null,null,null,null,null,null,null,null,null,"2016-08-03",null,null,null,null,null,null,208,null,null,null,22.7,"NO SATISFACTORIO"]
[null,null,null,null,null,null,null,null,null,null,null,null,null,null,null,"2016-08-04",null,null,null,null,null,null,209,null,null,null,22.8,"NO SATISFACTORIO"]
["NIVEL","Competencia","Concatenar","Definición de la competencia","Conductas asociadas",null,null,null,null,null,null,null,null,null,null,null,"2016-08-05",null,null,null,null,null,null,210,null,null,null,22.9,"NO SATISFACTORIO"]
[null,null,null,null,null,null,null,null,null,null,null,null,null,null,null,null,"2016-08-06",null,null,null,null,null,null,211,null,null,null,23,"NO SATISFACTORIO"]
["ASESOR","Orientación a resultados ",{"$f":"A221&B221","v":"ASESOROrientación a resultados "},"Realizar las funciones y cumplir los compromisos organizacionales con eficacia y calidad. ","▪ Cumple con oportunidad en función de estándares, objetivos y metas establecidas por la entidad, las funciones que le son asignadas.\n▪ Asume la responsabilidad por sus resultados.\n▪ Compromete recursos y tiempos para mejorar la productividad tomando las medidas necesarias para minimizar los riesgos.\n▪ Realiza todas las acciones necesarias para alcanzar los objetivos propuestos enfrentando los obstáculos que se presentan.",null,null,"NIVEL","COMPETENCIA",null,null,null,null,null,null,null,"2016-08-07",null,null,null,null,null,null,212,null,null,null,23.1,"NO SATISFACTORIO"]
["ASESOR","Orientación al usuario y al ciudadano",{"$f":"A222&B222","v":"ASESOROrientación al usuario y al ciudadano"},"Dirigir las decisiones y acciones a la satisfacción de las necesidades e intereses de los usuarios internos y externos, de conformidad con las responsabilidades públicas asignadas a la entidad.","▪ Atiende y valora las necesidades y peticiones de los usuarios y de ciudadanos en general.\n▪Considera las necesidades de los usuarios al diseñar proyectos o servicios.\n▪Da respuesta oportuna a las necesidades de los usuarios de conformidad con el servicio que ofrece la entidad.\n▪Establece diferentes canales de comunicación con el usuario para conocer sus necesidades y propuestas y responde a las mismas.\n▪Reconoce la interdependencia entre su trabajo y el de otros.",null,null,"PROFESIONAL",null,null,null,null,null,null,null,null,"2016-08-08",null,null,null,null,null,null,213,null,null,null,23.2,"NO SATISFACTORIO"]
["ASESOR","Compromiso con la Organización","ASESORCompromiso con la Organización","Alinear el propio comportamiento a las necesidades, prioridades y metas organizacionales.","▪Promueve las metas de la organización y respeta sus normas.\n▪Antepone las necesidades de la organización a sus propias necesidades.\n▪Apoya a la organización en situaciones difíciles.\n▪Demuestra sentido de pertenencia en todas sus actuaciones.",null,null,null,null,null,null,null,null,null,null,null,"2016-08-09",null,null,null,null,null,null,214,null,null,null,23.3,"NO SATISFACTORIO",null,"NIVEL","COMPETENCIA","DEFINICIÒN DE LA COMPETENCIA","CONDUCTAS ASOCIADAS"]
["ASESOR","Experticia profesional","ASESORExperticia profesional","Aplicar el conocimiento profesional","▪Orienta el desarrollo de proyectos especiales para el logro de resultados de la alta dirección.\n▪Aconseja y orienta la toma de decisiones en los temas que le han sido asignados.\n▪Asesora en materias propias de su campo de conocimiento, emitiendo conceptos, juicios o propuestas ajustados a lineamientos teóricos y técnicos.\n▪Se comunica de modo lógico, claro, efectivo y seguro.",null,null,null,null,null,null,null,null,null,null,null,"2016-08-10",null,null,null,null,null,null,215,null,null,null,23.4,"NO SATISFACTORIO",null,"ASESOR","Experticia","Aplicar el conocimiento profesional","▪Orienta el desarrollo de proyectos especiales para el logro de resultados de la alta dirección.\n▪Aconseja y orienta la toma de decisiones en los temas que le han sido asignados.\n▪Asesora en materias propias de su campo de conocimiento, emitiendo conceptos, juicios o propuestas ajustados a lineamientos teóricos y técnicos.\n▪Se comunica de modo lógico, claro, efectivo y seguro."]
["ASESOR","Conocimiento del entorno","ASESORConocimiento del entorno","Conocer e interpretar la organización, su funcionamiento y sus relaciones políticas y administrativas.","▪Comprende el entorno organizacional que enmarca las situaciones objeto de asesoría y lo toma como referente obligado para emitir juicios, conceptos o propuestas a desarrollar.\n▪Se informa permanentemente sobre políticas gubernamentales, problemas y demandas del entorno.",null,null,null,null,null,null,null,null,null,null,null,"2016-08-11",null,null,null,null,null,null,216,null,null,null,23.5,"NO SATISFACTORIO",null,"ASESOR","Conocimiento del entorno","Conocer e interpretar la organización, su funcionamiento y sus relaciones políticas y administrativas.","▪Comprende el entorno organizacional que enmarca las situaciones objeto de asesoría y lo toma como referente obligado para emitir juicios, conceptos o propuestas a desarrollar.\n▪Se informa permanentemente sobre políticas gubernamentales, problemas y demandas del entorno."]
["ASESOR","Construcción de relaciones","ASESORConstrucción de relaciones","Establecer y mantener relaciones cordiales y recíprocas con redes o grupos de personas internas y externas a la organización que faciliten la consecución de los objetivos institucionales.","▪Utiliza sus contactos para conseguir objetivos.\n▪Comparte información para establecer lazos.\n▪Interactúa con otros de un modo efectivo y adecuado.",null,null,null,null,null,null,null,null,null,null,null,"2016-08-12",null,null,null,null,null,null,217,null,null,null,23.6,"NO SATISFACTORIO",null,"ASESOR","Construcción de relaciones","Establecer y mantener relaciones cordiales y recíprocas con redes o grupos de personas internas y externas a la organización que faciliten la consecución de los objetivos institucionales.","▪Utiliza sus contactos para conseguir objetivos.\n▪Comparte información para establecer lazos.\n▪Interactúa con otros de un modo efectivo y adecuado."]
["ASESOR","Iniciativa","ASESORIniciativa","Anticiparse a los problemas iniciando acciones para superar los obstáculos y alcanzar metas concretas","▪Prevé situaciones y alternativas de solución que orientan la toma de decisiones de la alta dirección.\n▪Enfrenta los problemas y propone acciones concretas para solucionarlos.\n▪Reconoce y hace viables las oportunidades.",null,null,null,null,null,null,null,null,null,null,null,"2016-08-13",null,null,null,null,null,null,218,null,null,null,23.7,"NO SATISFACTORIO",null,"ASESOR","Iniciativa","Anticiparse a los problemas iniciando acciones para superar los obstáculos y alcanzar metas concretas","▪Prevé situaciones y alternativas de solución que orientan la toma de decisiones de la alta dirección.\n▪Enfrenta los problemas y propone acciones concretas para solucionarlos.\n▪Reconoce y hace viables las oportunidades."]
["PROFESIONAL","Orientación a resultados ","PROFESIONALOrientación a resultados ","Realizar las funciones y cumplir los compromisos organizacionales con eficacia y calidad. ","▪ Cumple con oportunidad en función de estándares, objetivos y metas establecidas por la entidad, las funciones que le son asignadas.\n▪ Asume la responsabilidad por sus resultados.\n▪ Compromete recursos y tiempos para mejorar la productividad tomando las medidas necesarias para minimizar los riesgos.\n▪ Realiza todas las acciones necesarias para alcanzar los objetivos propuestos enfrentando los obstáculos que se presentan.",null,null,"NIVEL","COMPETENCIA",null,null,null,null,null,null,null,"2016-08-07",null,null,null,null,null,null,212,null,null,null,23.1,"NO SATISFACTORIO"]
["PROFESIONAL","Orientación al usuario y al ciudadano","PROFESIONALOrientación al usuario y al ciudadano","Dirigir las decisiones y acciones a la satisfacción de las necesidades e intereses de los usuarios internos y externos, de conformidad con las responsabilidades públicas asignadas a la entidad.","▪ Atiende y valora las necesidades y peticiones de los usuarios y de ciudadanos en general.\n▪Considera las necesidades de los usuarios al diseñar proyectos o servicios.\n▪Da respuesta oportuna a las necesidades de los usuarios de conformidad con el servicio que ofrece la entidad.\n▪Establece diferentes canales de comunicación con el usuario para conocer sus necesidades y propuestas y responde a las mismas.\n▪Reconoce la interdependencia entre su trabajo y el de otros.",null,null,"ASESOR",null,null,null,null,null,null,null,null,"2016-08-08",null,null,null,null,null,null,213,null,null,null,23.2,"NO SATISFACTORIO"]
["PROFESIONAL","Compromiso con la Organización","PROFESIONALCompromiso con la Organización","Alinear el propio comportamiento a las necesidades, prioridades y metas organizacionales.","▪Promueve las metas de la organización y respeta sus normas.\n▪Antepone las necesidades de la organización a sus propias necesidades.\n▪Apoya a la organización en situaciones difíciles.\n▪Demuestra sentido de pertenencia en todas sus actuaciones.",null,null,null,null,null,null,null,null,null,null,null,"2016-08-09",null,null,null,null,null,null,214,null,null,null,23.3,"NO SATISFACTORIO",null,"NIVEL","COMPETENCIA","DEFINICIÒN DE LA COMPETENCIA","CONDUCTAS ASOCIADAS"]
["PROFESIONAL","Aprendizaje Continuo","PROFESIONALAprendizaje Continuo","Adquirir y desarrollar permanentemente conocimientos, destrezas y habilidades, con el fin de mantener altos estándares de eficacia organizacional.","▪Aprende de la experiencia de otros y de la propia.\n▪Se adapta y aplica nuevas tecnologías que se implanten en la organización.\n▪Aplica los conocimientos adquiridos a los desafíos que se presentan en el desarrollo del trabajo.\n▪Investiga, indaga y profundiza en los temas de su entorno área de desempeño.\n▪Reconoce las propias limitaciones y las necesidades de mejorar su preparación.\n▪Asimila nueva información y la aplica correctamente.",null,null,null,null,null,null,null,null,null,null,null,"2016-08-14",null,null,null,null,null,null,219,null,null,null,23.8,"NO SATISFACTORIO",null,"ASESOR","Orientación a resultados ","Realizar las funciones y cumplir los compromisos organizacionales con eficacia y calidad. ","▪ Cumple con oportunidad en función de estándares, objetivos y metas establecidas por la entidad, las funciones que le son asignadas.\n▪ Asume la responsabilidad por sus resultados.\n▪ Compromete recursos y tiempos para mejorar la productividad tomando las medidas necesarias para minimizar los riesgos.\n▪ Realiza todas las acciones necesarias para alcanzar los objetivos propuestos enfrentando los obstáculos que se presentan."]
["PROFESIONAL","Experticia profesional","PROFESIONALExperticia profesional","Aplicar el conocimiento profesional en la resolución de problemas y transferirlo a su entorno laboral.","▪Analiza de un modo sistemático y racional los aspectos del trabajo, basándose en la información relevante.\n▪Aplica reglas básicas y conceptos complejos aprendidos\n▪Identifica y reconoce con facilidad las causas de los problemas y sus soluciones.\n▪Clarifica datos o situaciones complejas.\n▪Planea, organiza y ejecuta múltiples tareas tendientes a alcanzar resultados institucionales.",null,null,null,null,null,null,null,null,null,null,null,"2016-08-15",null,null,null,null,null,null,220,null,null,null,23.9,"NO SATISFACTORIO",null,"ASESOR","Orientación al usuario y al ciudadano","Dirigir las decisiones y acciones a la satisfacción de las necesidades e intereses de los usuarios internos y externos, de conformidad con las responsabilidades públicas asignadas a la entidad.","▪ Atiende y valora las necesidades y peticiones de los usuarios y de ciudadanos en general.\n▪Considera las necesidades de los usuarios al diseñar proyectos o servicios.\n▪Da respuesta oportuna a las necesidades de los usuarios de conformidad con el servicio que ofrece la entidad.\n▪Establece diferentes canales de comunicación con el usuario para conocer sus necesidades y propuestas y responde a las mismas.\n▪Reconoce la interdependencia entre su trabajo y el de otros.\n"]
["PROFESIONAL","Trabajo en equipo y Colaboración","PROFESIONALTrabajo en equipo y Colaboración","Trabajar con otros de forma conjunta y de manera participativa, integrando esfuerzos para la consecución de metas institucionales comunes.","▪Coopera en distintas situaciones y comparte información.\n▪Aporta sugerencias, ideas y opiniones.\n▪Expresa expectativas positivas del equipo o de los miembros del mismo.\n▪Planifica las propias acciones teniendo en cuenta la repercusión de las mismas para la consecución de los objetivos grupales.\n▪Establece diálogo directo con los miembros del equipo que permita compartir información e ideas en condiciones de respeto y cordialidad.\n▪Respeta criterios dispares y distintas opiniones del equipo.",null,null,null,null,null,null,null,null,null,null,null,"2016-08-16",null,null,null,null,null,null,221,null,null,null,24,"NO SATISFACTORIO",null,"ASESOR","Compromiso con la Organización","Alinear el propio comportamiento a las necesidades, prioridades y metas organizacionales.","▪Promueve las metas de la organización y respeta sus normas.\n▪Antepone las necesidades de la organización a sus propias necesidades.\n▪Apoya a la organización en situaciones difíciles.\n▪Demuestra sentido de pertenencia en todas sus actuaciones."]
["PROFESIONAL","Creatividad e Innovación","PROFESIONALCreatividad e Innovación","Generar y desarrollar nuevas ideas, conceptos, métodos y soluciones.","▪Ofrece respuestas alternativas.\n▪Aprovecha las oportunidades y problemas para dar soluciones novedosas.\n▪Desarrolla nuevas formas de hacer y tecnologías.\n▪Busca nuevas alternativas de solución y se arriesga a romper esquemas tradicionales.\n▪Inicia acciones para superar los obstáculos y alcanzar metas específicas.",null,null,null,null,null,null,null,null,null,null,null,"2016-08-17",null,null,null,null,null,null,222,null,null,null,24.1,"NO SATISFACTORIO",null,"PROFESIONAL","Aprendizaje Continuo","Adquirir y desarrollar permanentemente conocimientos, destrezas y habilidades, con el fin de mantener altos estándares de eficacia organizacional.","▪Aprende de la experiencia de otros y de la propia.\n▪Se adapta y aplica nuevas tecnologías que se implanten en la organización.\n▪Aplica los conocimientos adquiridos a los desafíos que se presentan en el desarrollo del trabajo.\n▪Investiga, indaga y profundiza en los temas de su entorno área de desempeño.\n▪Reconoce las propias limitaciones y las necesidades de mejorar su preparación.\n▪Asimila nueva información y la aplica correctamente."]
["PROFESIONAL","Liderazgo de Grupos de Trabajo (personal a cargo)","PROFESIONALLiderazgo de Grupos de Trabajo (personal a cargo)","Asumir el rol de orientar y guía de un grupo o equipo de trabajo, utilizando la autoridad con arreglo a las normas y promoviendo la Efectividad en la consecución de objetivos y metas institucionales.","▪Establece los objetivos del grupo de forma clara y equilibrada.\n▪Asegura que los integrantes del grupo compartan planes, programas y proyectos institucionales.\n▪Orienta y coordina el trabajo del grupo para la identificación de planes y actividades a seguir.\n▪Facilita la colaboración con otras áreas y dependencias.\n▪Escucha y tiene en cuenta las opiniones de los integrantes del grupo.\n▪Gestiona los recursos necesarios para poder cumplir con las metas propuestas.\n▪Garantiza los recursos necesarios para poder cumplir con las metas propuestas.\n▪Garantiza que el grupo tenga la información necesaria.\n▪Explica las razones de las decisiones.",null,null,null,null,null,null,null,null,null,null,null,"2016-08-18",null,null,null,null,null,null,223,null,null,null,24.2,"NO SATISFACTORIO",null,"PROFESIONAL","Experticia profesional","Aplicar el conocimiento profesional en la resolución de problemas y transferirlo a su entorno laboral.","▪Analiza de un modo sistemático y racional los aspectos del trabajo, basándose en la información relevante.\n▪Aplica reglas básicas y conceptos complejos aprendidos\n▪Identifica y reconoce con facilidad las causas de los problemas y sus soluciones.\n▪Clarifica datos o situaciones complejas.\n▪Planea, organiza y ejecuta múltiples tareas tendientes a alcanzar resultados institucionales.\n"]
["PROFESIONAL","Toma de decisiones (personal a cargo)","PROFESIONALToma de decisiones (personal a cargo)","Elegir entre una o varias alternativas para solucionar un problema y tomar las acciones concretas y consecuentes con la elección realizada.","▪Elige alternativas de solución efectiva y suficiente para atender los asuntos encomendados.\n▪Decide y establece prioridades para el trabajo del grupo.\n▪Asume posiciones concretas para el manejo de temas o situaciones que demandan su atención.\n▪Efectúa cambios en las actividades o en la manera de desarrollar sus responsabilidades cuando detecta dificultades para su realización o mejores prácticas que pueden optimizar el desempeño.\n▪Asume las consecuencias de las decisiones adoptadas.\n▪Fomenta la participación en la toma de decisiones.",null,null,null,null,null,null,null,null,null,null,null,"2016-08-19",null,null,null,null,null,null,224,null,null,null,24.3,"NO SATISFACTORIO",null,"PROFESIONAL","Trabajo en equipo y Colaboración","Trabajar con otros de forma conjunta y de manera participativa, integrando esfuerzos para la consecución de metas institucionales comunes.","▪Coopera en distintas situaciones y comparte información.\n▪Aporta sugerencias, ideas y opiniones.\n▪Expresa expectativas positivas del equipo o de los miembros del mismo.\n▪Planifica las propias acciones teniendo en cuenta la repercusión de las mismas para la consecución de los objetivos grupales.\n▪Establece diálogo directo con los miembros del equipo que permita compartir información e ideas en condiciones de respeto y cordialidad.\n▪Respeta criterios dispares y distintas opiniones del equipo."]
["TECNICO","Orientación a resultados ","TECNICOOrientación a resultados ","Realizar las funciones y cumplir los compromisos organizacionales con eficacia y calidad. ","▪ Cumple con oportunidad en función de estándares, objetivos y metas establecidas por la entidad, las funciones que le son asignadas.\n▪ Asume la responsabilidad por sus resultados.\n▪ Compromete recursos y tiempos para mejorar la productividad tomando las medidas necesarias para minimizar los riesgos.\n▪ Realiza todas las acciones necesarias para alcanzar los objetivos propuestos enfrentando los obstáculos que se presentan.",null,null,"NIVEL","COMPETENCIA",null,null,null,null,null,null,null,"2016-08-07",null,null,null,null,null,null,212,null,null,null,23.1,"NO SATISFACTORIO"]
["TECNICO","Orientación al usuario y al ciudadano","TECNICOOrientación al usuario y al ciudadano","Dirigir las decisiones y acciones a la satisfacción de las necesidades e intereses de los usuarios internos y externos, de conformidad con las responsabilidades públicas asignadas a la entidad.","▪ Atiende y valora las necesidades y peticiones de los usuarios y de ciudadanos en general.\n▪Considera las necesidades de los usuarios al diseñar proyectos o servicios.\n▪Da respuesta oportuna a las necesidades de los usuarios de conformidad con el servicio que ofrece la entidad.\n▪Establece diferentes canales de comunicación con el usuario para conocer sus necesidades y propuestas y responde a las mismas.\n▪Reconoce la interdependencia entre su trabajo y el de otros.",null,null,"ASESOR","Orientación a resultados ",null,null,null,null,null,null,null,"2016-08-08",null,null,null,null,null,null,213,null,null,null,23.2,"NO SATISFACTORIO"]
["TECNICO","Compromiso con la Organización","TECNICOCompromiso con la Organización","Alinear el propio comportamiento a las necesidades, prioridades y metas organizacionales.","▪Promueve las metas de la organización y respeta sus normas.\n▪Antepone las necesidades de la organización a sus propias necesidades.\n▪Apoya a la organización en situaciones difíciles.\n▪Demuestra sentido de pertenencia en todas sus actuaciones.",null,null,null,null,null,null,null,null,null,null,null,"2016-08-09",null,null,null,null,null,null,214,null,null,null,23.3,"NO SATISFACTORIO",null,"NIVEL","COMPETENCIA","DEFINICIÒN DE LA COMPETENCIA","CONDUCTAS ASOCIADAS"]
["TECNICO","Experticia Técnica","TECNICOExperticia Técnica","Entender y aplicar los conocimientos técnicos del área de desempeño y mantenerlos actualizados","▪Capta y asimila con facilidad conceptos e información.\n▪Aplica el conocimiento técnico a las actividades cotidianas.\n▪Analiza la información de acuerdo con las necesidades de la organización.\n▪Comprende los aspectos técnicos y los aplica al desarrollo de procesos y procedimientos en los que está involucrado.\n▪Resuelve problemas utilizando sus conocimientos técnicos de su especialidad y garantizando indicadores y estándares establecidos.",null,null,null,null,null,null,null,null,null,null,null,"2016-08-20",null,null,null,null,null,null,225,null,null,null,24.4,"NO SATISFACTORIO",null,"PROFESIONAL","Creatividad e Innovación","Generar y desarrollar nuevas ideas, conceptos, métodos y soluciones.","▪Ofrece respuestas alternativas.\n▪Aprovecha las oportunidades y problemas para dar soluciones novedosas.\n▪Desarrolla nuevas formas de hacer y tecnologías.\n▪Busca nuevas alternativas de solución y se arriesga a romper esquemas tradicionales.\n▪Inicia acciones para superar los obstáculos y alcanzar metas específicas."]
["TECNICO","Trabajo en equipo","TECNICOTrabajo en equipo","Trabajar con otros para conseguir metas comunes","▪Identifica claramente los objetivos del grupo y orienta su trabajo a la consecución de los mismos.\n▪Colabora con otros para la realización de actividades y metas grupales.",null,null,null,null,null,null,null,null,null,null,null,"2016-08-21",null,null,null,null,null,null,226,null,null,null,24.5,"NO SATISFACTORIO",null,"PROFESIONAL","Orientación a resultados ","Realizar las funciones y cumplir los compromisos organizacionales con eficacia y calidad. ","▪ Cumple con oportunidad en función de estándares, objetivos y metas establecidas por la entidad, las funciones que le son asignadas.\n▪ Asume la responsabilidad por sus resultados.\n▪ Compromete recursos y tiempos para mejorar la productividad tomando las medidas necesarias para minimizar los riesgos.\n▪ Realiza todas las acciones necesarias para alcanzar los objetivos propuestos enfrentando los obstáculos que se presentan."]
["TECNICO","Creatividad e innovación","TECNICOCreatividad e innovación","Presentar ideas y métodos novedosos y concretarlos en acciones","▪Propone y encuentra formas nuevas y eficaces de hacer las cosas.\n▪Es recursivo.\n▪Es práctico.\n▪Busca nuevas alternativas de solución.\n▪Revisa permanentemente los procesos y procedimientos para optimizar los resultados.",null,null,null,null,null,null,null,null,null,null,null,"2016-08-22",null,null,null,null,null,null,227,null,null,null,24.599999999999898,"NO SATISFACTORIO",null,"PROFESIONAL","Orientación al usuario y al ciudadano","Dirigir las decisiones y acciones a la satisfacción de las necesidades e intereses de los usuarios internos y externos, de conformidad con las responsabilidades públicas asignadas a la entidad.","▪ Atiende y valora las necesidades y peticiones de los usuarios y de ciudadanos en general.\n▪Considera las necesidades de los usuarios al diseñar proyectos o servicios.\n▪Da respuesta oportuna a las necesidades de los usuarios de conformidad con el servicio que ofrece la entidad.\n▪Establece diferentes canales de comunicación con el usuario para conocer sus necesidades y propuestas y responde a las mismas.\n▪Reconoce la interdependencia entre su trabajo y el de otros.\n"]
["ASISTENCIAL","Orientación a resultados ","ASISTENCIALOrientación a resultados ","Realizar las funciones y cumplir los compromisos organizacionales con eficacia y calidad. ","▪ Cumple con oportunidad en función de estándares, objetivos y metas establecidas por la entidad, las funciones que le son asignadas.\n▪ Asume la responsabilidad por sus resultados.\n▪ Compromete recursos y tiempos para mejorar la productividad tomando las medidas necesarias para minimizar los riesgos.\n▪ Realiza todas las acciones necesarias para alcanzar los objetivos propuestos enfrentando los obstáculos que se presentan.",null,null,"NIVEL","COMPETENCIA",null,null,null,null,null,null,null,"2016-08-07",null,null,null,null,null,null,212,null,null,null,23.1,"NO SATISFACTORIO"]
["ASISTENCIAL","Orientación al usuario y al ciudadano","ASISTENCIALOrientación al usuario y al ciudadano","Dirigir las decisiones y acciones a la satisfacción de las necesidades e intereses de los usuarios internos y externos, de conformidad con las responsabilidades públicas asignadas a la entidad.","▪ Atiende y valora las necesidades y peticiones de los usuarios y de ciudadanos en general.\n▪Considera las necesidades de los usuarios al diseñar proyectos o servicios.\n▪Da respuesta oportuna a las necesidades de los usuarios de conformidad con el servicio que ofrece la entidad.\n▪Establece diferentes canales de comunicación con el usuario para conocer sus necesidades y propuestas y responde a las mismas.\n▪Reconoce la interdependencia entre su trabajo y el de otros.",null,null,"ASESOR",null,null,null,null,null,null,null,null,"2016-08-08",null,null,null,null,null,null,213,null,null,null,23.2,"NO SATISFACTORIO"]
["ASISTENCIAL","Compromiso con la Organización","ASISTENCIALCompromiso con la Organización","Alinear el propio comportamiento a las necesidades, prioridades y metas organizacionales.","▪Promueve las metas de la organización y respeta sus normas.\n▪Antepone las necesidades de la organización a sus propias necesidades.\n▪Apoya a la organización en situaciones difíciles.\n▪Demuestra sentido de pertenencia en todas sus actuaciones.",null,null,null,null,null,null,null,null,null,null,null,"2016-08-09",null,null,null,null,null,null,214,null,null,null,23.3,"NO SATISFACTORIO",null,"NIVEL","COMPETENCIA","DEFINICIÒN DE LA COMPETENCIA","CONDUCTAS ASOCIADAS"]
["ASISTENCIAL","Manejo de la información","ASISTENCIALManejo de la información","Manejar con respeto las informaciones personales e institucionales de que dispone.","▪Evade temas que indagan sobre información confidencial.\n▪Recoge sólo información imprescindible para el desarrollo de la tarea.\n▪Organiza y guarda de forma adecuada la información a su cuidado, teniendo en cuenta las normas legales y de la organización.\n▪No hace pública información laboral o de las personas que pueda afectar la organización o las personas.",null,null,null,null,null,null,null,null,null,null,null,"2016-08-23",null,null,null,null,null,null,228,null,null,"DIEZ",24.6999999999999,"NO SATISFACTORIO",null,"PROFESIONAL","Compromiso con la Organización","Alinear el propio comportamiento a las necesidades, prioridades y metas organizacionales.","▪Promueve las metas de la organización y respeta sus normas.\n▪Antepone las necesidades de la organización a sus propias necesidades.\n▪Apoya a la organización en situaciones difíciles.\n▪Demuestra sentido de pertenencia en todas sus actuaciones."]
["ASISTENCIAL","Adaptación al cambio","ASISTENCIALAdaptación al cambio","Enfrentarse con flexibilidad y versatilidad a situaciones nuevas para aceptar los cambios positiva y constructivamente.","▪Acepta y se adapta fácilmente los cambios.\n▪Responde al cambio con flexibilidad.\n▪Promueve el cambio.",null,null,null,null,null,null,null,null,null,null,null,"2016-08-24",null,null,null,null,null,null,229,null,null,null,24.799999999999901,"NO SATISFACTORIO",null,"PROFESIONAL CON PERSONAL A CARGO","Aprendizaje Continuo","Adquirir y desarrollar permanentemente conocimientos, destrezas y habilidades, con el fin de mantener altos estándares de eficacia organizacional.","▪Aprende de la experiencia de otros y de la propia.\n▪Se adapta y aplica nuevas tecnologías que se implanten en la organización.\n▪Aplica los conocimientos adquiridos a los desafíos que se presentan en el desarrollo del trabajo.\n▪Investiga, indaga y profundiza en los temas de su entorno área de desempeño.\n▪Reconoce las propias limitaciones y las necesidades de mejorar su preparación.\n▪Asimila nueva información y la aplica correctamente."]
["ASISTENCIAL","Disciplina","ASISTENCIALDisciplina","Adaptarse a las políticas institucionales y buscar información de los cambios en la autoridad competente.","▪Acepta instrucciones aunque se difiera de ellas.\n▪Realiza los cometidos y tareas del puesto de trabajo.\n▪Acepta la supervisión constante.\n▪Realiza funciones orientadas a apoyar la acción de otros miembros de la organización.",null,null,null,null,null,null,null,null,null,null,null,"2016-08-25",null,null,null,null,null,null,230,null,null,null,24.899999999999899,"NO SATISFACTORIO",null,"PROFESIONAL CON PERSONAL A CARGO","Experticia profesional","Aplicar el conocimiento profesional en la resolución de problemas y transferirlo a su entorno laboral.","▪Analiza de un modo sistemático y racional los aspectos del trabajo, basándose en la información relevante.\n▪Aplica reglas básicas y conceptos complejos aprendidos\n▪Identifica y reconoce con facilidad las causas de los problemas y sus soluciones.\n▪Clarifica datos o situaciones complejas.\n▪Planea, organiza y ejecuta múltiples tareas tendientes a alcanzar resultados institucionales.\n"]
["ASISTENCIAL","Relaciones Interpersonales","ASISTENCIALRelaciones Interpersonales","Establecer y mantener relaciones de trabajo amistosas y positivas, basadas en la comunicación abierta y fluida y en el respeto por los demás.","▪Escucha con interés a las personas y capta las preocupaciones, intereses y necesidades de los demás.\n▪Transmite eficazmente las ideas, sentimientos e información impidiendo con ello malos entendidos o situaciones confusas que puedan generar conflictos.",null,null,null,null,null,null,null,null,null,null,null,"2016-08-26",null,null,null,null,null,null,231,null,null,null,24.999999999999901,"NO SATISFACTORIO",null,"PROFESIONAL CON PERSONAL A CARGO","Trabajo en equipo y Colaboración","Trabajar con otros de forma conjunta y de manera participativa, integrando esfuerzos para la consecución de metas institucionales comunes.","▪Coopera en distintas situaciones y comparte información.\n▪Aporta sugerencias, ideas y opiniones.\n▪Expresa expectativas positivas del equipo o de los miembros del mismo.\n▪Planifica las propias acciones teniendo en cuenta la repercusión de las mismas para la consecución de los objetivos grupales.\n▪Establece diálogo directo con los miembros del equipo que permita compartir información e ideas en condiciones de respeto y cordialidad.\n▪Respeta criterios dispares y distintas opiniones del equipo."]
["ASISTENCIAL","Colaboración","ASISTENCIALColaboración","Cooperar con los demás con el fin de alcanzar los objetivos institucionales","▪Ayuda al logro de los objetivos articulando sus actuaciones con los demás.\n▪Cumple los compromisos que adquiere.\n▪Facilita la labor de sus superiores y compañeros de trabajo.",null,null,null,null,null,null,null,null,null,null,null,"2016-08-27",null,null,null,null,null,null,232,null,null,null,25.099999999999898,"NO SATISFACTORIO",null,"PROFESIONAL CON PERSONAL A CARGO","Creatividad e Innovación","Generar y desarrollar nuevas ideas, conceptos, métodos y soluciones.","▪Ofrece respuestas alternativas.\n▪Aprovecha las oportunidades y problemas para dar soluciones novedosas.\n▪Desarrolla nuevas formas de hacer y tecnologías.\n▪Busca nuevas alternativas de solución y se arriesga a romper esquemas tradicionales.\n▪Inicia acciones para superar los obstáculos y alcanzar metas específicas."]
[null,null,null,null,null,null,null,null,null,null,null,null,null,null,null,"2016-08-28",null,null,null,null,null,null,233,null,null,null,25.1999999999999,"NO SATISFACTORIO",null,"PROFESIONAL CON PERSONAL A CARGO","Orientación a resultados ","Realizar las funciones y cumplir los compromisos organizacionales con eficacia y calidad. ","▪ Cumple con oportunidad en función de estándares, objetivos y metas establecidas por la entidad, las funciones que le son asignadas.\n▪ Asume la responsabilidad por sus resultados.\n▪ Compromete recursos y tiempos para mejorar la productividad tomando las medidas necesarias para minimizar los riesgos.\n▪ Realiza todas las acciones necesarias para alcanzar los objetivos propuestos enfrentando los obstáculos que se presentan."]
[null,null,null,null,null,null,null,null,null,null,null,null,null,null,null,"2016-08-29",null,null,null,null,null,null,234,null,null,null,25.299999999999901,"NO SATISFACTORIO",null,"PROFESIONAL CON PERSONAL A CARGO","Orientación al usuario y al ciudadano","Dirigir las decisiones y acciones a la satisfacción de las necesidades e intereses de los usuarios internos y externos, de conformidad con las responsabilidades públicas asignadas a la entidad.","▪ Atiende y valora las necesidades y peticiones de los usuarios y de ciudadanos en general.\n▪Considera las necesidades de los usuarios al diseñar proyectos o servicios.\n▪Da respuesta oportuna a las necesidades de los usuarios de conformidad con el servicio que ofrece la entidad.\n▪Establece diferentes canales de comunicación con el usuario para conocer sus necesidades y propuestas y responde a las mismas.\n▪Reconoce la interdependencia entre su trabajo y el de otros.\n"]
["NIVELES DE PROFUNDIZACION DE LA COMPETENCIAS","RESULTADOS CUANTITATIVOS",null,null,null,null,"RESULTADOS CUANTITATIVOS",null,null,null,null,null,null,null,null,"2016-08-30",null,null,null,null,null,null,235,null,null,null,25.399999999999899,"NO SATISFACTORIO",null,"PROFESIONAL CON PERSONAL A CARGO","Compromiso con la Organización","Alinear el propio comportamiento a las necesidades, prioridades y metas organizacionales.","▪Promueve las metas de la organización y respeta sus normas.\n▪Antepone las necesidades de la organización a sus propias necesidades.\n▪Apoya a la organización en situaciones difíciles.\n▪Demuestra sentido de pertenencia en todas sus actuaciones."]
["NO EVALUADO",0,null,null,null,null,null,null,null,null,null,null,null,null,null,"2016-08-31",null,null,null,null,null,null,236,null,null,null,25.499999999999901,"NO SATISFACTORIO",null,"PROFESIONAL CON PERSONAL A CARGO","Liderazgo de Grupos de Trabajo","Asumir el rol de orientar y guía de un grupo o equipo de trabajo, utilizando la autoridad con arreglo a las normas y promoviendo la Efectividad en la consecución de objetivos y metas institucionales.","▪Establece los objetivos del grupo de forma clara y equilibrada.\n▪Asegura que los integrantes del grupo compartan planes, programas y proyectos institucionales.\n▪Orienta y coordina el trabajo del grupo para la identificación de planes y actividades a seguir.\n▪Facilita la colaboración con otras áreas y dependencias.\n▪Escucha y tiene en cuenta las opiniones de los integrantes del grupo.\n▪Gestiona los recursos necesarios para poder cumplir con las metas propuestas.\n▪Garantiza los recursos necesarios para poder cumplir con las metas propuestas.\n▪Garantiza que el grupo tenga la información necesaria.\n▪Explica las razones de las decisiones."]
["BAJO",4,null,null,null,null,4,null,null,null,null,null,null,null,null,"2016-09-01",null,null,null,null,null,null,237,null,null,null,25.599999999999898,"NO SATISFACTORIO",null,"PROFESIONAL CON PERSONAL A CARGO","Toma de decisiones","Elegir entre una o varias alternativas para solucionar un problema y tomar las acciones concretas y consecuentes con la elección realizada.","▪Elige alternativas de solución efectiva y suficiente para atender los asuntos encomendados.\n▪Decide y establece prioridades para el trabajo del grupo.\n▪Asume posiciones concretas para el manejo de temas o situaciones que demandan su atención.\n▪Efectúa cambios en las actividades o en la manera de desarrollar sus responsabilidades cuando detecta dificultades para su realización o mejores prácticas que pueden optimizar el desempeño.\n▪Asume las consecuencias de las decisiones adoptadas.\n▪Fomenta la participación en la toma de decisiones."]
["ACEPTABLE",6,5,null,null,null,6,null,null,null,null,null,null,null,null,"2016-09-02",null,null,null,null,null,null,238,null,null,null,25.6999999999999,"NO SATISFACTORIO",null,"PROFESIONAL CON PERSONAL A CARGO","Orientación a resultados ","Realizar las funciones y cumplir los compromisos organizacionales con eficacia y calidad. ","▪ Cumple con oportunidad en función de estándares, objetivos y metas establecidas por la entidad, las funciones que le son asignadas.\n▪ Asume la responsabilidad por sus resultados.\n▪ Compromete recursos y tiempos para mejorar la productividad tomando las medidas necesarias para minimizar los riesgos.\n▪ Realiza todas las acciones necesarias para alcanzar los objetivos propuestos enfrentando los obstáculos que se presentan."]
["ALTO",8,null,null,null,null,8,null,null,null,null,null,null,null,null,"2016-09-03",null,null,null,null,null,null,239,null,null,null,25.799999999999901,"NO SATISFACTORIO",null,"PROFESIONAL CON PERSONAL A CARGO","Orientación al usuario y al ciudadano","Dirigir las decisiones y acciones a la satisfacción de las necesidades e intereses de los usuarios internos y externos, de conformidad con las responsabilidades públicas asignadas a la entidad.","▪ Atiende y valora las necesidades y peticiones de los usuarios y de ciudadanos en general.\n▪Considera las necesidades de los usuarios al diseñar proyectos o servicios.\n▪Da respuesta oportuna a las necesidades de los usuarios de conformidad con el servicio que ofrece la entidad.\n▪Establece diferentes canales de comunicación con el usuario para conocer sus necesidades y propuestas y responde a las mismas.\n▪Reconoce la interdependencia entre su trabajo y el de otros.\n"]
["MUY ALTO",10,null,null,null,null,10,null,null,null,null,null,null,null,null,"2016-09-04",null,null,null,null,null,null,240,null,null,null,25.899999999999899,"NO SATISFACTORIO",null,"PROFESIONAL CON PERSONAL A CARGO","Compromiso con la Organización","Alinear el propio comportamiento a las necesidades, prioridades y metas organizacionales.","▪Promueve las metas de la organización y respeta sus normas.\n▪Antepone las necesidades de la organización a sus propias necesidades.\n▪Apoya a la organización en situaciones difíciles.\n▪Demuestra sentido de pertenencia en todas sus actuaciones."]
[null,null,null,null,null,null,null,null,null,null,null,null,null,null,null,"2016-09-05",null,null,null,null,null,null,241,null,null,null,25.999999999999901,"NO SATISFACTORIO",null,"TÈCNICO","Experticia Técnica","Entender y aplicar los conocimientos técnicos del área de desempeño y mantenerlos actualizados","▪Capta y asimila con facilidad conceptos e información.\n▪Aplica el conocimiento técnico a las actividades cotidianas.\n▪Analiza la información de acuerdo con las necesidades de la organización.\n▪Comprende los aspectos técnicos y los aplica al desarrollo de procesos y procedimientos en los que está involucrado.\n▪Resuelve problemas utilizando sus conocimientos técnicos de su especialidad y garantizando indicadores y estándares establecidos."]
[null,null,null,null,null,null,null,null,null,null,null,null,null,null,null,"2016-09-06",null,null,null,null,null,null,242,null,null,null,26.099999999999898,"NO SATISFACTORIO",null,"TÈCNICO","Trabajo en equipo","Trabajar con otros para conseguir metas comunes","▪Identifica claramente los objetivos del grupo y orienta su trabajo a la consecución de los mismos.\n▪Colabora con otros para la realización de actividades y metas grupales."]
[1,"1. Cambios en los planes, programas o proyectos que sirvieron de base para la concertación.",null,null,null,null,null,null,null,null,null,null,null,null,null,"2016-09-07",null,null,null,null,null,null,243,null,null,null,26.1999999999999,"NO SATISFACTORIO",null,"TÈCNICO","Creatividad e innovación","Presentar ideas y métodos novedosos y concretarlos en acciones","▪Propone y encuentra formas nuevas y eficaces de hacer las cosas.\n▪Es recursivo.\n▪Es práctico.\n▪Busca nuevas alternativas de solución.\n▪Revisa permanentemente los procesos y procedimientos para optimizar los resultados."]
[2,"2. Separación del cargo superior a treinta (30) días calendario que afecte el cumplimiento de los compromisos. ",null,null,null,null,null,null,null,null,null,null,null,null,null,"2016-09-08",null,null,null,null,null,null,244,null,null,null,26.299999999999901,"NO SATISFACTORIO",null,"TÈCNICO","Orientación a resultados ","Realizar las funciones y cumplir los compromisos organizacionales con eficacia y calidad. ","▪ Cumple con oportunidad en función de estándares, objetivos y metas establecidas por la entidad, las funciones que le son asignadas.\n▪ Asume la responsabilidad por sus resultados.\n▪ Compromete recursos y tiempos para mejorar la productividad tomando las medidas necesarias para minimizar los riesgos.\n▪ Realiza todas las acciones necesarias para alcanzar los objetivos propuestos enfrentando los obstáculos que se presentan."]
[3,"3. Traslado o encargo del empleado.",null,null,null,null,null,null,null,null,null,null,null,null,null,"2016-09-09",null,null,null,null,null,null,245,null,null,null,26.399999999999899,"NO SATISFACTORIO",null,"TÈCNICO","Orientación al usuario y al ciudadano","Dirigir las decisiones y acciones a la satisfacción de las necesidades e intereses de los usuarios internos y externos, de conformidad con las responsabilidades públicas asignadas a la entidad.","▪ Atiende y valora las necesidades y peticiones de los usuarios y de ciudadanos en general.\n▪Considera las necesidades de los usuarios al diseñar proyectos o servicios.\n▪Da respuesta oportuna a las necesidades de los usuarios de conformidad con el servicio que ofrece la entidad.\n▪Establece diferentes canales de comunicación con el usuario para conocer sus necesidades y propuestas y responde a las mismas.\n▪Reconoce la interdependencia entre su trabajo y el de otros.\n"]
[4,null,null,null,null,null,null,null,null,null,null,null,null,null,null,"2016-09-10",null,null,null,null,null,null,246,null,null,null,26.499999999999901,"NO SATISFACTORIO",null,"TÈCNICO","Compromiso con la Organización","Alinear el propio comportamiento a las necesidades, prioridades y metas organizacionales.","▪Promueve las metas de la organización y respeta sus normas.\n▪Antepone las necesidades de la organización a sus propias necesidades.\n▪Apoya a la organización en situaciones difíciles.\n▪Demuestra sentido de pertenencia en todas sus actuaciones."]
[5,null,null,null,null,null,null,null,null,null,null,null,null,null,null,"2016-09-11",null,null,null,null,null,null,247,null,null,null,26.599999999999898,"NO SATISFACTORIO",null,"ASISTENCIAL","Manejo de la información","Manejar con respeto las informaciones personales e institucionales de que dispone.","▪Evade temas que indagan sobre información confidencial.\n▪Recoge sólo información imprescindible para el desarrollo de la tarea.\n▪Organiza y guarda de forma adecuada la información a su cuidado, teniendo en cuenta las normas legales y de la organización.\n▪No hace pública información laboral o de las personas que pueda afectar la organización o las personas.\n"]
[6,null,null,null,null,null,null,null,null,null,null,null,null,null,null,"2016-09-12",null,null,null,null,null,null,248,null,null,null,26.6999999999999,"NO SATISFACTORIO",null,"ASISTENCIAL","Adaptación al cambio","Enfrentarse con flexibilidad y versatilidad a situaciones nuevas para aceptar los cambios positiva y constructivamente.","▪Acepta y se adapta fácilmente los cambios.\n▪Responde al cambio con flexibilidad.\n▪Promueve el cambio."]
[7,null,null,null,null,null,null,null,null,null,null,null,null,null,null,"2016-09-13",null,null,null,null,null,null,249,null,null,null,26.799999999999901,"NO SATISFACTORIO",null,"ASISTENCIAL","Disciplina","Adaptarse a las políticas institucionales y buscar información de los cambios en la autoridad competente.","▪Acepta instrucciones aunque se difiera de ellas.\n▪Realiza los cometidos y tareas del puesto de trabajo.\n▪Acepta la supervisión constante.\n▪Realiza funciones orientadas a apoyar la acción de otros miembros de la organización."]
[8,null,null,null,null,null,null,null,null,null,null,null,null,null,null,"2016-09-14",null,null,null,null,null,null,250,null,null,null,26.899999999999899,"NO SATISFACTORIO",null,"ASISTENCIAL","Relaciones Interpersonales","Establecer y mantener relaciones de trabajo amistosas y positivas, basadas en la comunicación abierta y fluida y en el respeto por los demás.","▪Escucha con interés a las personas y capta las preocupaciones, intereses y necesidades de los demás.\n▪Transmite eficazmente las ideas, sentimientos e información impidiendo con ello malos entendidos o situaciones confusas que puedan generar conflictos."]
[9,null,null,null,null,null,null,null,null,null,null,null,null,null,null,"2016-09-15",null,null,null,null,null,null,251,null,null,null,26.999999999999901,"NO SATISFACTORIO",null,"ASISTENCIAL","Colaboración","Cooperar con los demás con el fin de alcanzar los objetivos institucionales","▪Ayuda al logro de los objetivos articulando sus actuaciones con los demás.\n▪Cumple los compromisos que adquiere.\n▪Facilita la labor de sus superiores y compañeros de trabajo."]
[10,null,null,null,null,null,null,null,null,null,null,null,null,null,null,"2016-09-16",null,null,null,null,null,null,252,null,null,null,27.099999999999898,"NO SATISFACTORIO",null,"ASISTENCIAL","Orientación a resultados ","Realizar las funciones y cumplir los compromisos organizacionales con eficacia y calidad. ","▪ Cumple con oportunidad en función de estándares, objetivos y metas establecidas por la entidad, las funciones que le son asignadas.\n▪ Asume la responsabilidad por sus resultados.\n▪ Compromete recursos y tiempos para mejorar la productividad tomando las medidas necesarias para minimizar los riesgos.\n▪ Realiza todas las acciones necesarias para alcanzar los objetivos propuestos enfrentando los obstáculos que se presentan."]
[11,null,null,null,null,null,null,null,null,null,null,null,null,null,null,"2016-09-17",null,null,null,null,null,null,253,null,null,null,27.1999999999999,"NO SATISFACTORIO",null,"ASISTENCIAL","Orientación al usuario y al ciudadano","Dirigir las decisiones y acciones a la satisfacción de las necesidades e intereses de los usuarios internos y externos, de conformidad con las responsabilidades públicas asignadas a la entidad.","▪ Atiende y valora las necesidades y peticiones de los usuarios y de ciudadanos en general.\n▪Considera las necesidades de los usuarios al diseñar proyectos o servicios.\n▪Da respuesta oportuna a las necesidades de los usuarios de conformidad con el servicio que ofrece la entidad.\n▪Establece diferentes canales de comunicación con el usuario para conocer sus necesidades y propuestas y responde a las mismas.\n▪Reconoce la interdependencia entre su trabajo y el de otros.\n"]
[12,null,null,null,null,null,null,null,null,null,null,null,null,null,null,"2016-09-18",null,null,null,null,null,null,254,null,null,null,27.299999999999901,"NO SATISFACTORIO",null,"ASISTENCIAL","Compromiso con la Organización","Alinear el propio comportamiento a las necesidades, prioridades y metas organizacionales.","▪Promueve las metas de la organización y respeta sus normas.\n▪Antepone las necesidades de la organización a sus propias necesidades.\n▪Apoya a la organización en situaciones difíciles.\n▪Demuestra sentido de pertenencia en todas sus actuaciones."]
[13,null,null,null,null,null,null,null,null,null,null,null,null,null,null,"2016-09-19",null,null,null,null,null,null,255,null,null,null,27.399999999999899,"NO SATISFACTORIO"]
[14,null,null,null,null,null,null,null,null,null,null,null,null,null,null,"2016-09-20",null,null,null,null,null,null,256,null,null,null,27.499999999999901,"NO SATISFACTORIO"]
[15,null,null,null,null,null,null,null,null,null,null,null,null,null,null,"2016-09-21",null,null,null,null,null,null,257,null,null,null,27.599999999999898,"NO SATISFACTORIO"]
[16,null,null,null,null,null,null,null,null,null,null,null,null,null,null,"2016-09-22",null,null,null,null,null,null,258,null,null,null,27.6999999999999,"NO SATISFACTORIO"]
[17,null,null,null,null,null,null,null,null,null,null,null,null,null,null,"2016-09-23",null,null,null,null,null,null,259,null,null,null,27.799999999999901,"NO SATISFACTORIO"]
[18,null,null,null,null,null,null,null,null,null,null,null,null,null,null,"2016-09-24",null,null,null,null,null,null,260,null,null,null,27.899999999999899,"NO SATISFACTORIO"]
[19,null,null,null,null,null,null,null,null,null,null,null,null,null,null,"2016-09-25",null,null,null,null,null,null,261,null,null,null,27.999999999999901,"NO SATISFACTORIO"]
[20,null,null,null,null,null,null,null,null,null,null,null,null,null,null,"2016-09-26",null,null,null,null,null,null,262,null,null,null,28.099999999999898,"NO SATISFACTORIO"]
[21,null,null,null,null,null,null,null,null,null,null,null,null,null,null,"2016-09-27",null,null,null,null,null,null,263,null,null,null,28.1999999999999,"NO SATISFACTORIO"]
[22,null,null,null,null,null,null,null,null,null,null,null,null,null,null,"2016-09-28",null,null,null,null,null,null,264,null,null,null,28.299999999999901,"NO SATISFACTORIO"]
[23,null,null,null,null,null,null,null,null,null,null,null,null,null,null,"2016-09-29",null,null,null,null,null,null,265,null,null,null,28.399999999999899,"NO SATISFACTORIO"]
[24,null,null,null,null,null,null,null,null,null,null,null,null,null,null,"2016-09-30",null,null,null,null,null,null,266,null,null,null,28.499999999999901,"NO SATISFACTORIO"]
[25,null,null,null,null,null,null,null,null,null,null,null,null,null,null,"2016-10-01",null,null,null,null,null,null,267,null,null,null,28.599999999999898,"NO SATISFACTORIO"]
[26,null,null,null,null,null,null,null,null,null,null,null,null,null,null,"2016-10-02",null,null,null,null,null,null,268,null,null,null,28.6999999999999,"NO SATISFACTORIO"]
[27,null,null,null,null,null,null,null,null,null,null,null,null,null,null,"2016-10-03",null,null,null,null,null,null,269,null,null,null,28.799999999999901,"NO SATISFACTORIO"]
[28,null,null,null,null,null,null,null,null,null,null,null,null,null,null,"2016-10-04",null,null,null,null,null,null,270,null,null,null,28.899999999999899,"NO SATISFACTORIO"]
[29,null,null,null,null,null,null,null,null,null,null,null,null,null,null,"2016-10-05",null,null,null,null,null,null,271,null,null,null,28.999999999999901,"NO SATISFACTORIO"]
[30,null,null,null,null,null,null,null,null,null,null,null,null,null,null,"2016-10-06",null,null,null,null,null,null,272,null,null,null,29.099999999999898,"NO SATISFACTORIO"]
[31,null,null,null,null,null,null,null,null,null,null,null,null,null,null,"2016-10-07",null,null,null,null,null,null,273,null,null,null,29.1999999999999,"NO SATISFACTORIO"]
[32,null,null,null,null,null,null,null,null,null,null,null,null,null,null,"2016-10-08",null,null,null,null,null,null,274,null,null,null,29.299999999999901,"NO SATISFACTORIO"]
[33,null,null,null,null,null,null,null,null,null,null,null,null,null,null,"2016-10-09",null,null,null,null,null,null,275,null,null,null,29.399999999999899,"NO SATISFACTORIO"]
[34,null,null,null,null,null,null,null,null,null,null,null,null,null,null,"2016-10-10",null,null,null,null,null,null,276,null,null,null,29.499999999999901,"NO SATISFACTORIO"]
[35,null,null,null,null,null,null,null,null,null,null,null,null,null,null,"2016-10-11",null,null,null,null,null,null,277,null,null,null,29.599999999999898,"NO SATISFACTORIO"]
[36,null,null,null,null,null,null,null,null,null,null,null,null,null,null,"2016-10-12",null,null,null,null,null,null,278,null,null,null,29.6999999999999,"NO SATISFACTORIO"]
[37,null,null,null,null,null,null,null,null,null,null,null,null,null,null,"2016-10-13",null,null,null,null,null,null,279,null,null,null,29.799999999999901,"NO SATISFACTORIO"]
[38,null,null,null,null,null,null,null,null,null,null,null,null,null,null,"2016-10-14",null,null,null,null,null,null,280,null,null,null,29.899999999999899,"NO SATISFACTORIO"]
[39,null,null,null,null,null,null,null,null,null,null,null,null,null,null,"2016-10-15",null,null,null,null,null,null,281,null,null,null,29.999999999999901,"NO SATISFACTORIO"]
[40,null,null,null,null,null,null,null,null,null,null,null,null,null,null,"2016-10-16",null,null,null,null,null,null,282,null,null,null,30.099999999999898,"NO SATISFACTORIO"]
[41,null,null,null,null,null,null,null,null,null,null,null,null,null,null,"2016-10-17",null,null,null,null,null,null,283,null,null,null,30.1999999999999,"NO SATISFACTORIO"]
[42,null,null,null,null,null,null,null,null,null,null,null,null,null,null,"2016-10-18",null,null,null,null,null,null,284,null,null,null,30.299999999999901,"NO SATISFACTORIO"]
[43,null,null,null,null,null,null,null,null,null,null,null,null,null,null,"2016-10-19",null,null,null,null,null,null,285,null,null,null,30.399999999999899,"NO SATISFACTORIO"]
[44,null,null,null,null,null,null,null,null,null,null,null,null,null,null,"2016-10-20",null,null,null,null,null,null,286,null,null,null,30.499999999999901,"NO SATISFACTORIO"]
[45,null,null,null,null,null,null,null,null,null,null,null,null,null,null,"2016-10-21",null,null,null,null,null,null,287,null,null,null,30.599999999999898,"NO SATISFACTORIO"]
[46,null,null,null,null,null,null,null,null,null,null,null,null,null,null,"2016-10-22",null,null,null,null,null,null,288,null,null,null,30.6999999999999,"NO SATISFACTORIO"]
[47,null,null,null,null,null,null,null,null,null,null,null,null,null,null,"2016-10-23",null,null,null,null,null,null,289,null,null,null,30.799999999999901,"NO SATISFACTORIO"]
[48,null,null,null,null,null,null,null,null,null,null,null,null,null,null,"2016-10-24",null,null,null,null,null,null,290,null,null,null,30.899999999999899,"NO SATISFACTORIO"]
[49,null,null,null,null,null,null,null,null,null,null,null,null,null,null,"2016-10-25",null,null,null,null,null,null,291,null,null,null,30.999999999999901,"NO SATISFACTORIO"]
[50,null,null,null,null,null,null,null,null,null,null,null,null,null,null,"2016-10-26",null,null,null,null,null,null,292,null,null,null,31.099999999999898,"NO SATISFACTORIO"]
[51,null,null,null,null,null,null,null,null,null,null,null,null,null,null,"2016-10-27",null,null,null,null,null,null,293,null,null,null,31.1999999999999,"NO SATISFACTORIO"]
[52,null,null,null,null,null,null,null,null,null,null,null,null,null,null,"2016-10-28",null,null,null,null,null,null,294,null,null,null,31.299999999999901,"NO SATISFACTORIO"]
[53,null,null,null,null,null,null,null,null,null,null,null,null,null,null,"2016-10-29",null,null,null,null,null,null,295,null,null,null,31.399999999999899,"NO SATISFACTORIO"]
[54,null,null,null,null,null,null,null,null,null,null,null,null,null,null,"2016-10-30",null,null,null,null,null,null,296,null,null,null,31.499999999999901,"NO SATISFACTORIO"]
[55,null,null,null,null,null,null,null,null,null,null,null,null,null,null,"2016-10-31",null,null,null,null,null,null,297,null,null,null,31.599999999999898,"NO SATISFACTORIO"]
[56,null,null,null,null,null,null,null,null,null,null,null,null,null,null,"2016-11-01",null,null,null,null,null,null,298,null,null,null,31.6999999999999,"NO SATISFACTORIO"]
[57,null,null,null,null,null,null,null,null,null,null,null,null,null,null,"2016-11-02",null,null,null,null,null,null,299,null,null,null,31.799999999999901,"NO SATISFACTORIO"]
[58,null,null,null,null,null,null,null,null,null,null,null,null,null,null,"2016-11-03",null,null,null,null,null,null,300,null,null,null,31.899999999999899,"NO SATISFACTORIO"]
[59,null,null,null,null,null,null,null,null,null,null,null,null,null,null,"2016-11-04",null,null,null,null,null,null,301,null,null,null,31.999999999999901,"NO SATISFACTORIO"]
[60,null,null,null,null,null,null,null,null,null,null,null,null,null,null,"2016-11-05",null,null,null,null,null,null,302,null,null,null,32.099999999999902,"NO SATISFACTORIO"]
[61,null,null,null,null,null,null,null,null,null,null,null,null,null,null,"2016-11-06",null,null,null,null,null,null,303,null,null,null,32.199999999999903,"NO SATISFACTORIO"]
[62,null,null,null,null,null,null,null,null,null,null,null,null,null,null,"2016-11-07",null,null,null,null,null,null,304,null,null,null,32.299999999999898,"NO SATISFACTORIO"]
[63,null,null,null,null,null,null,null,null,null,null,null,null,null,null,"2016-11-08",null,null,null,null,null,null,305,null,null,null,32.399999999999899,"NO SATISFACTORIO"]
[64,null,null,null,null,null,null,null,null,null,null,null,null,null,null,"2016-11-09",null,null,null,null,null,null,306,null,null,null,32.499999999999901,"NO SATISFACTORIO"]
[65,null,null,null,null,null,null,null,null,null,null,null,null,null,null,"2016-11-10",null,null,null,null,null,null,307,null,null,null,32.599999999999902,"NO SATISFACTORIO"]
[66,null,null,null,null,null,null,null,null,null,null,null,null,null,null,"2016-11-11",null,null,null,null,null,null,308,null,null,null,32.699999999999903,"NO SATISFACTORIO"]
[67,null,null,null,null,null,null,null,null,null,null,null,null,null,null,"2016-11-12",null,null,null,null,null,null,309,null,null,null,32.799999999999898,"NO SATISFACTORIO"]
[68,null,null,null,null,null,null,null,null,null,null,null,null,null,null,"2016-11-13",null,null,null,null,null,null,310,null,null,null,32.899999999999899,"NO SATISFACTORIO"]
[69,null,null,null,null,null,null,null,null,null,null,null,null,null,null,"2016-11-14",null,null,null,null,null,null,311,null,null,null,32.999999999999901,"NO SATISFACTORIO"]
[70,null,null,null,null,null,null,null,null,null,null,null,null,null,null,"2016-11-15",null,null,null,null,null,null,312,null,null,null,33.099999999999902,"NO SATISFACTORIO"]
[71,null,null,null,null,null,null,null,null,null,null,null,null,null,null,"2016-11-16",null,null,null,null,null,null,313,null,null,null,33.199999999999903,"NO SATISFACTORIO"]
[72,null,null,null,null,null,null,null,null,null,null,null,null,null,null,"2016-11-17",null,null,null,null,null,null,314,null,null,null,33.299999999999898,"NO SATISFACTORIO"]
[73,null,null,null,null,null,null,null,null,null,null,null,null,null,null,"2016-11-18",null,null,null,null,null,null,315,null,null,null,33.399999999999899,"NO SATISFACTORIO"]
[74,null,null,null,null,null,null,null,null,null,null,null,null,null,null,"2016-11-19",null,null,null,null,null,null,316,null,null,null,33.499999999999901,"NO SATISFACTORIO"]
[75,null,null,null,null,null,null,null,null,null,null,null,null,null,null,"2016-11-20",null,null,null,null,null,null,317,null,null,null,33.599999999999902,"NO SATISFACTORIO"]
[76,null,null,null,null,null,null,null,null,null,null,null,null,null,null,"2016-11-21",null,null,null,null,null,null,318,null,null,null,33.699999999999903,"NO SATISFACTORIO"]
[77,null,null,null,null,null,null,null,null,null,null,null,null,null,null,"2016-11-22",null,null,null,null,null,null,319,null,null,null,33.799999999999898,"NO SATISFACTORIO"]
[78,null,null,null,null,null,null,null,null,null,null,null,null,null,null,"2016-11-23",null,null,null,null,null,null,320,null,null,null,33.899999999999899,"NO SATISFACTORIO"]
[79,null,null,null,null,null,null,null,null,null,null,null,null,null,null,"2016-11-24",null,null,null,null,null,null,321,null,null,null,33.999999999999901,"NO SATISFACTORIO"]
[80,null,null,null,null,null,null,null,null,null,null,null,null,null,null,"2016-11-25",null,null,null,null,null,null,322,null,null,null,34.099999999999902,"NO SATISFACTORIO"]
[81,null,null,null,null,null,null,null,null,null,null,null,null,null,null,"2016-11-26",null,null,null,null,null,null,323,null,null,null,34.199999999999903,"NO SATISFACTORIO"]
[82,null,null,null,null,null,null,null,null,null,null,null,null,null,null,"2016-11-27",null,null,null,null,null,null,324,null,null,null,34.299999999999898,"NO SATISFACTORIO"]
[83,null,null,null,null,null,null,null,null,null,null,null,null,null,null,"2016-11-28",null,null,null,null,null,null,325,null,null,null,34.399999999999899,"NO SATISFACTORIO"]
[84,null,null,null,null,null,null,null,null,null,null,null,null,null,null,"2016-11-29",null,null,null,null,null,null,326,null,null,null,34.499999999999901,"NO SATISFACTORIO"]
[85,null,null,null,null,null,null,null,null,null,null,null,null,null,null,"2016-11-30",null,null,null,null,null,null,327,null,null,null,34.599999999999902,"NO SATISFACTORIO"]
[86,null,null,null,null,null,null,null,null,null,null,null,null,null,null,"2016-12-01",null,null,null,null,null,null,328,null,null,null,34.699999999999903,"NO SATISFACTORIO"]
[87,null,null,null,null,null,null,null,null,null,null,null,null,null,null,"2016-12-02",null,null,null,null,null,null,329,null,null,null,34.799999999999898,"NO SATISFACTORIO"]
[88,null,null,null,null,null,null,null,null,null,null,null,null,null,null,"2016-12-03",null,null,null,null,null,null,330,null,null,null,34.899999999999899,"NO SATISFACTORIO"]
[89,null,null,null,null,null,null,null,null,null,null,null,null,null,null,"2016-12-04",null,null,null,null,null,null,331,null,null,null,34.999999999999901,"NO SATISFACTORIO"]
[90,null,null,null,null,null,null,null,null,null,null,null,null,null,null,"2016-12-05",null,null,null,null,null,null,332,null,null,null,35.099999999999902,"NO SATISFACTORIO"]
[91,null,null,null,null,null,null,null,null,null,null,null,null,null,null,"2016-12-06",null,null,null,null,null,null,333,null,null,null,35.199999999999903,"NO SATISFACTORIO"]
[92,null,null,null,null,null,null,null,null,null,null,null,null,null,null,"2016-12-07",null,null,null,null,null,null,334,null,null,null,35.299999999999898,"NO SATISFACTORIO"]
[93,null,null,null,null,null,null,null,null,null,null,null,null,null,null,"2016-12-08",null,null,null,null,null,null,335,null,null,null,35.399999999999899,"NO SATISFACTORIO"]
[94,null,null,null,null,null,null,null,null,null,null,null,null,null,null,"2016-12-09",null,null,null,null,null,null,336,null,null,null,35.499999999999901,"NO SATISFACTORIO"]
[95,null,null,null,null,null,null,null,null,null,null,null,null,null,null,"2016-12-10",null,null,null,null,null,null,337,null,null,null,35.599999999999902,"NO SATISFACTORIO"]
[96,null,null,null,null,null,null,null,null,null,null,null,null,null,null,"2016-12-11",null,null,null,null,null,null,338,null,null,null,35.699999999999903,"NO SATISFACTORIO"]
[97,null,null,null,null,null,null,null,null,null,null,null,null,null,null,"2016-12-12",null,null,null,null,null,null,339,null,null,null,35.799999999999898,"NO SATISFACTORIO"]
[98,null,null,null,null,null,null,null,null,null,null,null,null,null,null,"2016-12-13",null,null,null,null,null,null,340,null,null,null,35.899999999999899,"NO SATISFACTORIO"]
[99,null,null,null,null,null,null,null,null,null,null,null,null,null,null,"2016-12-14",null,null,null,null,null,null,341,null,null,null,35.999999999999901,"NO SATISFACTORIO"]
[100,null,null,null,null,null,null,null,null,null,null,null,null,null,null,"2016-12-15",null,null,null,null,null,null,342,null,null,null,36.099999999999902,"NO SATISFACTORIO"]
[101,null,null,null,null,null,null,null,null,null,null,null,null,null,null,"2016-12-16",null,null,null,null,null,null,343,null,null,null,36.199999999999903,"NO SATISFACTORIO"]
[102,null,null,null,null,null,null,null,null,null,null,null,null,null,null,"2016-12-17",null,null,null,null,null,null,344,null,null,null,36.299999999999898,"NO SATISFACTORIO"]
[103,null,null,null,null,null,null,null,null,null,null,null,null,null,null,"2016-12-18",null,null,null,null,null,null,345,null,null,null,36.399999999999899,"NO SATISFACTORIO"]
[104,null,null,null,null,null,null,null,null,null,null,null,null,null,null,"2016-12-19",null,null,null,null,null,null,346,null,null,null,36.499999999999901,"NO SATISFACTORIO"]
[105,null,null,null,null,null,null,null,null,null,null,null,null,null,null,"2016-12-20",null,null,null,null,null,null,347,null,null,null,36.599999999999902,"NO SATISFACTORIO"]
[106,null,null,null,null,null,null,null,null,null,null,null,null,null,null,"2016-12-21",null,null,null,null,null,null,348,null,null,null,36.699999999999903,"NO SATISFACTORIO"]
[107,null,null,null,null,null,null,null,null,null,null,null,null,null,null,"2016-12-22",null,null,null,null,null,null,349,null,null,null,36.799999999999898,"NO SATISFACTORIO"]
[108,null,null,null,null,null,null,null,null,null,null,null,null,null,null,"2016-12-23",null,null,null,null,null,null,350,null,null,null,36.899999999999899,"NO SATISFACTORIO"]
[109,null,null,null,null,null,null,null,null,null,null,null,null,null,null,"2016-12-24",null,null,null,null,null,null,351,null,null,null,36.999999999999901,"NO SATISFACTORIO"]
[110,null,null,null,null,null,null,null,null,null,null,null,null,null,null,"2016-12-25",null,null,null,null,null,null,352,null,null,null,37.099999999999902,"NO SATISFACTORIO"]
[111,null,null,null,null,null,null,null,null,null,null,null,null,null,null,"2016-12-26",null,null,null,null,null,null,353,null,null,null,37.199999999999903,"NO SATISFACTORIO"]
[112,null,null,null,null,null,null,null,null,null,null,null,null,null,null,"2016-12-27",null,null,null,null,null,null,354,null,null,null,37.299999999999898,"NO SATISFACTORIO"]
[113,null,null,null,null,null,null,null,null,null,null,null,null,null,null,"2016-12-28",null,null,null,null,null,null,355,null,null,null,37.399999999999899,"NO SATISFACTORIO"]
[114,null,null,null,null,null,null,null,null,null,null,null,null,null,null,"2016-12-29",null,null,null,null,null,null,356,null,null,null,37.499999999999901,"NO SATISFACTORIO"]
[115,null,null,null,null,null,null,null,null,null,null,null,null,null,null,"2016-12-30",null,null,null,null,null,null,357,null,null,null,37.599999999999902,"NO SATISFACTORIO"]
[116,null,null,null,null,null,null,null,null,null,null,null,null,null,null,"2016-12-31",null,null,null,null,null,null,358,null,null,null,37.699999999999903,"NO SATISFACTORIO"]
[117,null,null,null,null,null,null,null,null,null,null,null,null,null,null,"2017-01-01",null,null,null,null,null,null,359,null,null,null,37.799999999999898,"NO SATISFACTORIO"]
[118,null,null,null,null,null,null,null,null,null,null,null,null,null,null,"2017-01-02",null,null,null,null,null,null,360,null,null,null,37.899999999999899,"NO SATISFACTORIO"]
[119,null,null,null,null,null,null,null,null,null,null,null,null,null,null,"2017-01-03",null,null,null,null,null,null,null,null,null,null,37.999999999999901,"NO SATISFACTORIO"]
[120,null,null,null,null,null,null,null,null,null,null,null,null,null,null,"2017-01-04",null,null,null,null,null,null,null,null,null,null,38.099999999999902,"NO SATISFACTORIO"]
[121,null,null,null,null,null,null,null,null,null,null,null,null,null,null,"2017-01-05",null,null,null,null,null,null,null,null,null,null,38.199999999999903,"NO SATISFACTORIO"]
[122,null,null,null,null,null,null,null,null,null,null,null,null,null,null,"2017-01-06",null,null,null,null,null,null,null,null,null,null,38.299999999999898,"NO SATISFACTORIO"]
[123,null,null,null,null,null,null,null,null,null,null,null,null,null,null,"2017-01-07",null,null,null,null,null,null,null,null,null,null,38.399999999999899,"NO SATISFACTORIO"]
[124,null,null,null,null,null,null,null,null,null,null,null,null,null,null,"2017-01-08",null,null,null,null,null,null,null,null,null,null,38.499999999999901,"NO SATISFACTORIO"]
[125,null,null,null,null,null,null,null,null,null,null,null,null,null,null,"2017-01-09",null,null,null,null,null,null,null,null,null,null,38.599999999999902,"NO SATISFACTORIO"]
[126,null,null,null,null,null,null,null,null,null,null,null,null,null,null,"2017-01-10",null,null,null,null,null,null,null,null,null,null,38.699999999999903,"NO SATISFACTORIO"]
[127,null,null,null,null,null,null,null,null,null,null,null,null,null,null,"2017-01-11",null,null,null,null,null,null,null,null,null,null,38.799999999999898,"NO SATISFACTORIO"]
[128,null,null,null,null,null,null,null,null,null,null,null,null,null,null,"2017-01-12",null,null,null,null,null,null,null,null,null,null,38.899999999999899,"NO SATISFACTORIO"]
[129,null,null,null,null,null,null,null,null,null,null,null,null,null,null,"2017-01-13",null,null,null,null,null,null,null,null,null,null,38.999999999999901,"NO SATISFACTORIO"]
[130,null,null,null,null,null,null,null,null,null,null,null,null,null,null,"2017-01-14",null,null,null,null,null,null,null,null,null,null,39.099999999999902,"NO SATISFACTORIO"]
[131,null,null,null,null,null,null,null,null,null,null,null,null,null,null,"2017-01-15",null,null,null,null,null,null,null,null,null,null,39.199999999999903,"NO SATISFACTORIO"]
[132,null,null,null,null,null,null,null,null,null,null,null,null,null,null,"2017-01-16",null,null,null,null,null,null,null,null,null,null,39.299999999999898,"NO SATISFACTORIO"]
[133,null,null,null,null,null,null,null,null,null,null,null,null,null,null,"2017-01-17",null,null,null,null,null,null,null,null,null,null,39.399999999999899,"NO SATISFACTORIO"]
[134,null,null,null,null,null,null,null,null,null,null,null,null,null,null,"2017-01-18",null,null,null,null,null,null,null,null,null,null,39.499999999999901,"NO SATISFACTORIO"]
[135,null,null,null,null,null,null,null,null,null,null,null,null,null,null,"2017-01-19",null,null,null,null,null,null,null,null,null,null,39.599999999999902,"NO SATISFACTORIO"]
[136,null,null,null,null,null,null,null,null,null,null,null,null,null,null,"2017-01-20",null,null,null,null,null,null,null,null,null,null,39.699999999999903,"NO SATISFACTORIO"]
[137,null,null,null,null,null,null,null,null,null,null,null,null,null,null,"2017-01-21",null,null,null,null,null,null,null,null,null,null,39.799999999999898,"NO SATISFACTORIO"]
[138,null,null,null,null,null,null,null,null,null,null,null,null,null,null,"2017-01-22",null,null,null,null,null,null,null,null,null,null,39.899999999999899,"NO SATISFACTORIO"]
[139,null,null,null,null,null,null,null,null,null,null,null,null,null,null,"2017-01-23",null,null,null,null,null,null,null,null,null,null,39.999999999999901,"NO SATISFACTORIO"]
[140,null,null,null,null,null,null,null,null,null,null,null,null,null,null,"2017-01-24",null,null,null,null,null,null,null,null,null,null,40.099999999999902,"NO SATISFACTORIO"]
[141,null,null,null,null,null,null,null,null,null,null,null,null,null,null,"2017-01-25",null,null,null,null,null,null,null,null,null,null,40.199999999999903,"NO SATISFACTORIO"]
[142,null,null,null,null,null,null,null,null,null,null,null,null,null,null,"2017-01-26",null,null,null,null,null,null,null,null,null,null,40.299999999999898,"NO SATISFACTORIO"]
[143,null,null,null,null,null,null,null,null,null,null,null,null,null,null,"2017-01-27",null,null,null,null,null,null,null,null,null,null,40.399999999999899,"NO SATISFACTORIO"]
[144,null,null,null,null,null,null,null,null,null,null,null,null,null,null,"2017-01-28",null,null,null,null,null,null,null,null,null,null,40.499999999999901,"NO SATISFACTORIO"]
[145,null,null,null,null,null,null,null,null,null,null,null,null,null,null,"2017-01-29",null,null,null,null,null,null,null,null,null,null,40.599999999999902,"NO SATISFACTORIO"]
[146,null,null,null,null,null,null,null,null,null,null,null,null,null,null,"2017-01-30",null,null,null,null,null,null,null,null,null,null,40.699999999999903,"NO SATISFACTORIO"]
[147,null,null,null,null,null,null,null,null,null,null,null,null,null,null,"2017-01-31",null,null,null,null,null,null,null,null,null,null,40.799999999999898,"NO SATISFACTORIO"]
[148,null,null,null,null,null,null,null,null,null,null,null,null,null,null,"2017-02-01",null,null,null,null,null,null,null,null,null,null,40.899999999999899,"NO SATISFACTORIO"]
[149,null,null,null,null,null,null,null,null,null,null,null,null,null,null,"2017-02-02",null,null,null,null,null,null,null,null,null,null,40.999999999999901,"NO SATISFACTORIO"]
[150,null,null,null,null,null,null,null,null,null,null,null,null,null,null,"2017-02-03",null,null,null,null,null,null,null,null,null,null,41.099999999999902,"NO SATISFACTORIO"]
[151,null,null,null,null,null,null,null,null,null,null,null,null,null,null,"2017-02-04",null,null,null,null,null,null,null,null,null,null,41.199999999999903,"NO SATISFACTORIO"]
[152,null,null,null,null,null,null,null,null,null,null,null,null,null,null,"2017-02-05",null,null,null,null,null,null,null,null,null,null,41.299999999999898,"NO SATISFACTORIO"]
[153,null,null,null,null,null,null,null,null,null,null,null,null,null,null,"2017-02-06",null,null,null,null,null,null,null,null,null,null,41.399999999999899,"NO SATISFACTORIO"]
[154,null,null,null,null,null,null,null,null,null,null,null,null,null,null,"2017-02-07",null,null,null,null,null,null,null,null,null,null,41.499999999999901,"NO SATISFACTORIO"]
[155,null,null,null,null,null,null,null,null,null,null,null,null,null,null,"2017-02-08",null,null,null,null,null,null,null,null,null,null,41.599999999999902,"NO SATISFACTORIO"]
[156,null,null,null,null,null,null,null,null,null,null,null,null,null,null,"2017-02-09",null,null,null,null,null,null,null,null,null,null,41.699999999999903,"NO SATISFACTORIO"]
[157,null,null,null,null,null,null,null,null,null,null,null,null,null,null,"2017-02-10",null,null,null,null,null,null,null,null,null,null,41.799999999999898,"NO SATISFACTORIO"]
[158,null,null,null,null,null,null,null,null,null,null,null,null,null,null,"2017-02-11",null,null,null,null,null,null,null,null,null,null,41.899999999999899,"NO SATISFACTORIO"]
[159,null,null,null,null,null,null,null,null,null,null,null,null,null,null,"2017-02-12",null,null,null,null,null,null,null,null,null,null,41.999999999999901,"NO SATISFACTORIO"]
[160,null,null,null,null,null,null,null,null,null,null,null,null,null,null,"2017-02-13",null,null,null,null,null,null,null,null,null,null,42.099999999999902,"NO SATISFACTORIO"]
[161,null,null,null,null,null,null,null,null,null,null,null,null,null,null,"2017-02-14",null,null,null,null,null,null,null,null,null,null,42.199999999999903,"NO SATISFACTORIO"]
[162,null,null,null,null,null,null,null,null,null,null,null,null,null,null,"2017-02-15",null,null,null,null,null,null,null,null,null,null,42.299999999999898,"NO SATISFACTORIO"]
[163,null,null,null,null,null,null,null,null,null,null,null,null,null,null,"2017-02-16",null,null,null,null,null,null,null,null,null,null,42.399999999999899,"NO SATISFACTORIO"]
[164,null,null,null,null,null,null,null,null,null,null,null,null,null,null,"2017-02-17",null,null,null,null,null,null,null,null,null,null,42.499999999999901,"NO SATISFACTORIO"]
[165,null,null,null,null,null,null,null,null,null,null,null,null,null,null,"2017-02-18",null,null,null,null,null,null,null,null,null,null,42.599999999999902,"NO SATISFACTORIO"]
[166,null,null,null,null,null,null,null,null,null,null,null,null,null,null,"2017-02-19",null,null,null,null,null,null,null,null,null,null,42.699999999999903,"NO SATISFACTORIO"]
[167,null,null,null,null,null,null,null,null,null,null,null,null,null,null,"2017-02-20",null,null,null,null,null,null,null,null,null,null,42.799999999999898,"NO SATISFACTORIO"]
[168,null,null,null,null,null,null,null,null,null,null,null,null,null,null,"2017-02-21",null,null,null,null,null,null,null,null,null,null,42.899999999999899,"NO SATISFACTORIO"]
[169,null,null,null,null,null,null,null,null,null,null,null,null,null,null,"2017-02-22",null,null,null,null,null,null,null,null,null,null,42.999999999999901,"NO SATISFACTORIO"]
[170,null,null,null,null,null,null,null,null,null,null,null,null,null,null,"2017-02-23",null,null,null,null,null,null,null,null,null,null,43.099999999999902,"NO SATISFACTORIO"]
[171,null,null,null,null,null,null,null,null,null,null,null,null,null,null,"2017-02-24",null,null,null,null,null,null,null,null,null,null,43.199999999999903,"NO SATISFACTORIO"]
[172,null,null,null,null,null,null,null,null,null,null,null,null,null,null,"2017-02-25",null,null,null,null,null,null,null,null,null,null,43.299999999999898,"NO SATISFACTORIO"]
[173,null,null,null,null,null,null,null,null,null,null,null,null,null,null,"2017-02-26",null,null,null,null,null,null,null,null,null,null,43.399999999999899,"NO SATISFACTORIO"]
[174,null,null,null,null,null,null,null,null,null,null,null,null,null,null,"2017-02-27",null,null,null,null,null,null,null,null,null,null,43.499999999999901,"NO SATISFACTORIO"]
[175,null,null,null,null,null,null,null,null,null,null,null,null,null,null,"2017-02-28",null,null,null,null,null,null,null,null,null,null,43.599999999999902,"NO SATISFACTORIO"]
[176,null,null,null,null,null,null,null,null,null,null,null,null,null,null,"2017-03-01",null,null,null,null,null,null,null,null,null,null,43.699999999999903,"NO SATISFACTORIO"]
[177,null,null,null,null,null,null,null,null,null,null,null,null,null,null,"2017-03-02",null,null,null,null,null,null,null,null,null,null,43.799999999999898,"NO SATISFACTORIO"]
[null,null,null,null,null,null,null,null,null,null,null,null,null,null,null,"2017-03-03",null,null,null,null,null,null,null,null,null,null,43.899999999999899,"NO SATISFACTORIO"]
["COMPROMISO LABORAL",null,null,null,null,null,null,null,null,null,null,null,null,null,null,"2017-03-04",null,null,null,null,null,null,null,null,null,null,43.999999999999901,"NO SATISFACTORIO"]
["COMPETENCIA COMPORTAMENTAL",null,null,null,null,null,null,null,null,null,null,null,null,null,null,"2017-03-05",null,null,null,null,null,null,null,null,null,null,44.099999999999902,"NO SATISFACTORIO"]
[null,null,null,null,null,null,null,null,null,null,null,null,null,null,null,"2017-03-06",null,null,null,null,null,null,null,null,null,null,44.199999999999903,"NO SATISFACTORIO"]
["SEGUIMIENTO",null,null,null,null,null,null,null,null,null,null,null,null,null,null,"2017-03-07",null,null,null,null,null,null,null,null,null,null,44.299999999999898,"NO SATISFACTORIO"]
["EXTRAORDINARIA",null,null,null,null,null,null,null,null,null,null,null,null,null,null,"2017-03-08",null,null,null,null,null,null,null,null,null,null,44.399999999999899,"NO SATISFACTORIO"]
["EVENTUAL",null,null,null,null,null,null,null,null,null,null,null,null,null,null,"2017-03-09",null,null,null,null,null,null,null,null,null,null,44.499999999999901,"NO SATISFACTORIO"]
["1. PARCIAL SEMESTRAL",null,null,null,null,null,null,null,null,null,null,null,null,null,null,"2017-03-10",null,null,null,null,null,null,null,null,null,null,44.599999999999902,"NO SATISFACTORIO"]
["EVA. INF. A 1 AÑO",null,null,null,null,null,null,null,null,null,null,null,null,null,null,"2017-03-11",null,null,null,null,null,null,null,null,null,null,44.699999999999903,"NO SATISFACTORIO"]
["2. PARCIAL SEMESTRAL",null,null,null,null,null,null,null,null,null,null,null,null,null,null,"2017-03-12",null,null,null,null,null,null,null,null,null,null,44.799999999999898,"NO SATISFACTORIO"]
["PERÍODO DE PRUEBA",null,null,null,null,null,null,null,null,null,null,null,null,null,null,"2017-03-13",null,null,null,null,null,null,null,null,null,null,44.899999999999899,"NO SATISFACTORIO"]
[null,null,null,null,null,null,null,null,null,null,null,null,null,null,null,"2017-03-14",null,null,null,null,null,null,null,null,null,null,44.999999999999901,"NO SATISFACTORIO"]
[null,null,null,null,null,null,null,null,null,null,null,null,null,null,null,"2017-03-15",null,null,null,null,null,null,null,null,null,null,45.099999999999902,"NO SATISFACTORIO"]
[null,null,null,null,null,null,null,null,null,null,null,null,null,null,null,"2017-03-16",null,null,null,null,null,null,null,null,null,null,45.199999999999903,"NO SATISFACTORIO"]
[null,null,null,null,null,null,null,null,null,null,null,null,null,null,null,"2017-03-17",null,null,null,null,null,null,null,null,null,null,45.299999999999898,"NO SATISFACTORIO"]
[null,null,null,null,null,null,null,null,null,null,null,null,null,null,null,"2017-03-18",null,null,null,null,null,null,null,null,null,null,45.399999999999899,"NO SATISFACTORIO"]
[null,null,null,null,null,null,null,null,null,null,null,null,null,null,null,"2017-03-19",null,null,null,null,null,null,null,null,null,null,45.499999999999901,"NO SATISFACTORIO"]
[null,null,null,null,null,null,null,null,null,null,null,null,null,null,null,"2017-03-20",null,null,null,null,null,null,null,null,null,null,45.599999999999902,"NO SATISFACTORIO"]
[null,null,null,null,null,null,null,null,null,null,null,null,null,null,null,"2017-03-21",null,null,null,null,null,null,null,null,null,null,45.699999999999903,"NO SATISFACTORIO"]
[null,null,null,null,null,null,null,null,null,null,null,null,null,null,null,"2017-03-22",null,null,null,null,null,null,null,null,null,null,45.799999999999898,"NO SATISFACTORIO"]
[null,null,null,null,null,null,null,null,null,null,null,null,null,null,null,"2017-03-23",null,null,null,null,null,null,null,null,null,null,45.899999999999899,"NO SATISFACTORIO"]
[null,null,null,null,null,null,null,null,null,null,null,null,null,null,null,"2017-03-24",null,null,null,null,null,null,null,null,null,null,45.999999999999901,"NO SATISFACTORIO"]
["NO EVALUADO",0,null,null,null,null,null,null,null,null,null,null,null,null,null,"2017-03-25",null,null,null,null,null,null,null,null,null,null,46.099999999999902,"NO SATISFACTORIO"]
["BAJO",6,4,null,null,null,null,null,null,null,null,null,null,null,null,"2017-03-26",null,null,null,null,null,null,null,null,null,null,46.199999999999903,"NO SATISFACTORIO"]
["ACEPTABLE",9,6,null,null,null,null,null,null,null,null,null,null,null,null,"2017-03-27",null,null,null,null,null,null,null,null,null,null,46.299999999999898,"NO SATISFACTORIO"]
["ALTO",12,8,null,null,null,null,null,null,null,null,null,null,null,null,"2017-03-28",null,null,null,null,null,null,null,null,null,null,46.399999999999899,"NO SATISFACTORIO"]
["MUY ALTO",15,10,null,null,null,null,null,null,null,null,null,null,null,null,"2017-03-29",null,null,null,null,null,null,null,null,null,null,46.499999999999901,"NO SATISFACTORIO"]
[null,null,null,null,null,null,null,null,null,null,null,null,null,null,null,"2017-03-30",null,null,null,null,null,null,null,null,null,null,46.599999999999902,"NO SATISFACTORIO"]
[null,null,null,null,null,null,null,null,null,null,null,null,null,null,null,"2017-03-31",null,null,null,null,null,null,null,null,null,null,46.699999999999903,"NO SATISFACTORIO"]
["Período anual u ordinario- Compromiso 1",{"$f":"'[3]F2. COMP. LAB Y COM COMPOR'!H37","v":0},null,null,null,null,null,null,null,null,null,null,null,null,null,"2017-04-01",null,null,null,null,null,null,null,null,null,null,46.799999999999898,"NO SATISFACTORIO"]
["Período anual u ordinario- Compromiso 2",{"$f":"'[3]F2. COMP. LAB Y COM COMPOR'!H39","v":0},null,null,null,null,null,null,null,null,null,null,null,null,null,"2017-04-02",null,null,null,null,null,null,null,null,null,null,46.899999999999899,"NO SATISFACTORIO"]
["Período anual u ordinario- Compromiso 3",{"$f":"'[3]F2. COMP. LAB Y COM COMPOR'!H41","v":0},null,null,null,null,null,null,null,null,null,null,null,null,null,"2017-04-03",null,null,null,null,null,null,null,null,null,null,46.999999999999901,"NO SATISFACTORIO"]
["Período anual u ordinario- Compromiso 4",{"$f":"'[3]F2. COMP. LAB Y COM COMPOR'!H43","v":0},null,null,null,null,null,null,null,null,null,null,null,null,null,"2017-04-04",null,null,null,null,null,null,null,null,null,null,47.099999999999902,"NO SATISFACTORIO"]
["Período anual u ordinario- Compromiso 5",{"$f":"'[3]F2. COMP. LAB Y COM COMPOR'!H45","v":0},null,null,null,null,null,null,null,null,null,null,null,null,null,"2017-04-05",null,null,null,null,null,null,null,null,null,null,47.199999999999903,"NO SATISFACTORIO"]
["Período anual u ordinario- Competencia 1",{"$f":"'[3]F2. COMP. LAB Y COM COMPOR'!B51","v":0},null,null,null,null,null,null,null,null,null,null,null,null,null,"2017-04-06",null,null,null,null,null,null,null,null,null,null,47.299999999999898,"NO SATISFACTORIO"]
["Período anual u ordinario- Competencia 2",{"$f":"'[3]F2. COMP. LAB Y COM COMPOR'!B53","v":0},null,null,null,null,null,null,null,null,null,null,null,null,null,"2017-04-08",null,null,null,null,null,null,null,null,null,null,47.399999999999899,"NO SATISFACTORIO"]
["Período anual u ordinario- Competencia 3",{"$f":"'[3]F2. COMP. LAB Y COM COMPOR'!B55","v":0},null,null,null,null,null,null,null,null,null,null,null,null,null,"2017-04-09",null,null,null,null,null,null,null,null,null,null,47.499999999999901,"NO SATISFACTORIO"]
["Período anual u ordinario- Competencia 4",{"$f":"'[3]F2. COMP. LAB Y COM COMPOR'!B57","v":0},null,null,null,null,null,null,null,null,null,null,null,null,null,"2017-04-10",null,null,null,null,null,null,null,null,null,null,47.599999999999902,"NO SATISFACTORIO"]
["Período de prueba- Compromiso 1",{"$f":"'[3]F11. EVA P. PRUEBA'!F37","v":0},null,null,null,null,null,null,null,null,null,null,null,null,null,"2017-04-11",null,null,null,null,null,null,null,null,null,null,47.699999999999903,"NO SATISFACTORIO"]
["Período de prueba- Compromiso 2",{"$f":"'[3]F11. EVA P. PRUEBA'!F38","v":0},null,null,null,null,null,null,null,null,null,null,null,null,null,"2017-04-12",null,null,null,null,null,null,null,null,null,null,47.799999999999898,"NO SATISFACTORIO"]
["Período de prueba- Compromiso 3",{"$f":"'[3]F11. EVA P. PRUEBA'!F39","v":0},null,null,null,null,null,null,null,null,null,null,null,null,null,"2017-04-13",null,null,null,null,null,null,null,null,null,null,47.899999999999899,"NO SATISFACTORIO"]
["Período de prueba- Competencia 1",{"$f":"'[3]F11. EVA P. PRUEBA'!A46","v":"Planeación"},null,null,null,null,null,null,null,null,null,null,null,null,null,"2017-04-14",null,null,null,null,null,null,null,null,null,null,47.999999999999901,"NO SATISFACTORIO"]
["Período de prueba- Competencia 2",{"$f":"'[3]F11. EVA P. PRUEBA'!A48","v":"Liderazgo"},null,null,null,null,null,null,null,null,null,null,null,null,null,"2017-04-15",null,null,null,null,null,null,null,null,null,null,48.099999999999902,"NO SATISFACTORIO"]
["Período de prueba- Competencia 3",{"$f":"'[3]F11. EVA P. PRUEBA'!A50","v":"Compromiso con la Organización"},null,null,null,null,null,null,null,null,null,null,null,null,null,"2017-04-16",null,null,null,null,null,null,null,null,null,null,48.199999999999903,"NO SATISFACTORIO"]
["Período de prueba- Competencia 4",{"$f":"'[3]F11. EVA P. PRUEBA'!A52","v":"Orientación al usuario y al ciudadano"},null,null,null,null,null,null,null,null,null,null,null,null,null,"2017-04-18",null,null,null,null,null,null,null,null,null,null,48.299999999999898,"NO SATISFACTORIO"]
[null,null,null,null,null,null,null,null,null,null,null,null,null,null,null,"2017-04-19",null,null,null,null,null,null,null,null,null,null,48.399999999999899,"NO SATISFACTORIO"]
[null,null,null,null,null,null,null,null,null,null,null,null,null,null,null,"2017-04-20",null,null,null,null,null,null,null,null,null,null,48.499999999999901,"NO SATISFACTORIO"]
["Período de prueba",null,null,null,null,null,null,null,null,null,null,null,null,null,null,"2017-04-21",null,null,null,null,null,null,null,null,null,null,48.599999999999902,"NO SATISFACTORIO"]
["Período anual u ordinario",null,null,null,null,null,null,null,null,null,null,null,null,null,null,"2017-04-22",null,null,null,null,null,null,null,null,null,null,48.699999999999903,"NO SATISFACTORIO"]
[null,null,null,null,null,null,null,null,null,null,null,null,null,null,null,"2017-04-23",null,null,null,null,null,null,null,null,null,null,48.799999999999898,"NO SATISFACTORIO"]
[null,null,null,null,null,null,null,null,null,null,null,null,null,null,null,"2017-04-24",null,null,null,null,null,null,null,null,null,null,48.899999999999899,"NO SATISFACTORIO"]
[null,null,null,null,null,null,null,null,null,null,null,null,null,null,null,"2017-04-25",null,null,null,null,null,null,null,null,null,null,48.999999999999901,"NO SATISFACTORIO"]
["EVALUACION EXTRAORDINARIA",null,null,null,null,null,null,null,null,null,null,null,null,null,null,"2017-04-26",null,null,null,null,null,null,null,null,null,null,49.099999999999902,"NO SATISFACTORIO"]
["SUMA EVALUACION PREVIA","SUMA EVALUACION ULTIMO PERIODO",null,null,null,null,null,null,null,null,null,null,null,null,null,"2017-04-27",null,null,null,null,null,null,null,null,null,null,49.199999999999903,"NO SATISFACTORIO"]
[{"$f":"IF('[3]F9. EV. EXTRAORDINARIA'!F51=\"\",0,VLOOKUP('[3]F9. EV. EXTRAORDINARIA'!F51,'Hoja4 (2)'!$A$461:$B$464,2,FALSE))","v":0},{"$f":"IF('[3]F9. EV. EXTRAORDINARIA'!H51=\"\",0,VLOOKUP('[3]F9. EV. EXTRAORDINARIA'!H51,'Hoja4 (2)'!$A$461:$B$464,2,FALSE))","v":0},null,null,null,null,null,null,null,null,null,null,null,null,null,"2017-04-28",null,null,null,null,null,null,null,null,null,null,49.299999999999898,"NO SATISFACTORIO"]
[{"$f":"IF('[3]F9. EV. EXTRAORDINARIA'!F52=\"\",0,VLOOKUP('[3]F9. EV. EXTRAORDINARIA'!F52,'Hoja4 (2)'!$A$461:$B$464,2,FALSE))","v":0},{"$f":"IF('[3]F9. EV. EXTRAORDINARIA'!H52=\"\",0,VLOOKUP('[3]F9. EV. EXTRAORDINARIA'!H52,'Hoja4 (2)'!$A$461:$B$464,2,FALSE))","v":0},null,null,null,null,null,null,null,null,null,null,null,null,null,"2017-04-29",null,null,null,null,null,null,null,null,null,null,49.399999999999899,"NO SATISFACTORIO"]
[{"$f":"IF('[3]F9. EV. EXTRAORDINARIA'!F53=\"\",0,VLOOKUP('[3]F9. EV. EXTRAORDINARIA'!F53,'Hoja4 (2)'!$A$461:$B$464,2,FALSE))","v":0},{"$f":"IF('[3]F9. EV. EXTRAORDINARIA'!H53=\"\",0,VLOOKUP('[3]F9. EV. EXTRAORDINARIA'!H53,'Hoja4 (2)'!$A$461:$B$464,2,FALSE))","v":0},null,null,null,null,null,null,null,null,null,null,null,null,null,"2017-04-30",null,null,null,null,null,null,null,null,null,null,49.499999999999901,"NO SATISFACTORIO"]
[{"$f":"IF('[3]F9. EV. EXTRAORDINARIA'!F54=\"\",0,VLOOKUP('[3]F9. EV. EXTRAORDINARIA'!F54,'Hoja4 (2)'!$A$461:$B$464,2,FALSE))","v":0},{"$f":"IF('[3]F9. EV. EXTRAORDINARIA'!H54=\"\",0,VLOOKUP('[3]F9. EV. EXTRAORDINARIA'!H54,'Hoja4 (2)'!$A$461:$B$464,2,FALSE))","v":0},null,null,null,null,null,null,null,null,null,null,null,null,null,"2017-05-01",null,null,null,null,null,null,null,null,null,null,49.599999999999902,"NO SATISFACTORIO"]
[{"$f":"SUBTOTAL(9,A492:A495)","v":0},{"$f":"SUBTOTAL(9,B492:B495)","v":0},null,null,null,null,null,null,null,null,null,null,null,null,null,"2017-05-02",null,null,null,null,null,null,null,null,null,null,49.699999999999903,"NO SATISFACTORIO"]
[null,null,null,null,null,null,null,null,null,null,null,null,null,null,null,"2017-05-03",null,null,null,null,null,null,null,null,null,null,49.799999999999898,"NO SATISFACTORIO"]
[null,null,null,null,null,null,null,null,null,null,null,null,null,null,null,"2017-05-04",null,null,null,null,null,null,null,null,null,null,49.899999999999899,"NO SATISFACTORIO"]
[null,null,null,null,null,null,null,null,null,null,null,null,null,null,null,"2017-05-05",null,null,null,null,null,null,null,null,null,null,49.999999999999901,"NO SATISFACTORIO"]
[null,null,null,null,null,null,null,null,null,null,null,null,null,null,null,"2017-05-06",null,null,null,null,null,null,null,null,null,null,50.099999999999902,"NO SATISFACTORIO"]
[null,null,null,null,null,null,null,null,null,null,null,null,null,null,null,"2017-05-07",null,null,null,null,null,null,null,null,null,null,50.199999999999903,"NO SATISFACTORIO"]
["EVALUACION INFERIOR A 1 AÑO",null,null,null,null,null,null,null,null,null,null,null,null,null,null,"2017-05-08",null,null,null,null,null,null,null,null,null,null,50.299999999999898,"NO SATISFACTORIO"]
["SUMA EVALUACION PREVIA","SUMA EVALUACION ULTIMO PERIODO",null,null,null,null,null,null,null,null,null,null,null,null,null,"2017-05-09",null,null,null,null,null,null,null,null,null,null,50.399999999999899,"NO SATISFACTORIO"]
[{"$f":"IF('[3]F10. EVA. INFERIOR A 1 AÑO'!F51=\"\",0,VLOOKUP('[3]F10. EVA. INFERIOR A 1 AÑO'!F51,'Hoja4 (2)'!$A$461:$C$464,3,FALSE))","v":0},{"$f":"IF('[3]F10. EVA. INFERIOR A 1 AÑO'!H51=\"\",0,VLOOKUP('[3]F10. EVA. INFERIOR A 1 AÑO'!H51,'Hoja4 (2)'!$A$461:$C$464,3,FALSE))","v":0},null,null,null,null,null,null,null,null,null,null,null,null,null,"2017-05-10",null,null,null,null,null,null,null,null,null,null,50.499999999999901,"NO SATISFACTORIO"]
[{"$f":"IF('[3]F10. EVA. INFERIOR A 1 AÑO'!F52=\"\",0,VLOOKUP('[3]F10. EVA. INFERIOR A 1 AÑO'!F52,'Hoja4 (2)'!$A$461:$C$464,3,FALSE))","v":0},{"$f":"IF('[3]F10. EVA. INFERIOR A 1 AÑO'!H52=\"\",0,VLOOKUP('[3]F10. EVA. INFERIOR A 1 AÑO'!H52,'Hoja4 (2)'!$A$461:$C$464,3,FALSE))","v":0},null,null,null,null,null,null,null,null,null,null,null,null,null,"2017-05-11",null,null,null,null,null,null,null,null,null,null,50.599999999999902,"NO SATISFACTORIO"]
[{"$f":"IF('[3]F10. EVA. INFERIOR A 1 AÑO'!F53=\"\",0,VLOOKUP('[3]F10. EVA. INFERIOR A 1 AÑO'!F53,'Hoja4 (2)'!$A$461:$C$464,3,FALSE))","v":0},{"$f":"IF('[3]F10. EVA. INFERIOR A 1 AÑO'!H53=\"\",0,VLOOKUP('[3]F10. EVA. INFERIOR A 1 AÑO'!H53,'Hoja4 (2)'!$A$461:$C$464,3,FALSE))","v":0},null,null,null,null,null,null,null,null,null,null,null,null,null,"2017-05-12",null,null,null,null,null,null,null,null,null,null,50.699999999999903,"NO SATISFACTORIO"]
[{"$f":"IF('[3]F10. EVA. INFERIOR A 1 AÑO'!F54=\"\",0,VLOOKUP('[3]F10. EVA. INFERIOR A 1 AÑO'!F54,'Hoja4 (2)'!$A$461:$C$464,3,FALSE))","v":0},{"$f":"IF('[3]F10. EVA. INFERIOR A 1 AÑO'!H54=\"\",0,VLOOKUP('[3]F10. EVA. INFERIOR A 1 AÑO'!H54,'Hoja4 (2)'!$A$461:$C$464,3,FALSE))","v":0},null,null,null,null,null,null,null,null,null,null,null,null,null,"2017-05-13",null,null,null,null,null,null,null,null,null,null,50.799999999999898,"NO SATISFACTORIO"]
[{"$f":"SUBTOTAL(9,A504:A507)","v":0},{"$f":"SUBTOTAL(9,B504:B507)","v":0},null,null,null,null,null,null,null,null,null,null,null,null,null,"2017-05-14",null,null,null,null,null,null,null,null,null,null,50.899999999999899,"NO SATISFACTORIO"]
[null,null,null,null,null,null,null,null,null,null,null,null,null,null,null,"2017-05-15",null,null,null,null,null,null,null,null,null,null,50.999999999999901,"NO SATISFACTORIO"]
[null,null,null,null,null,null,null,null,null,null,null,null,null,null,null,"2017-05-16",null,null,null,null,null,null,null,null,null,null,51.099999999999902,"NO SATISFACTORIO"]
[null,null,null,null,null,null,null,null,null,null,null,null,null,null,null,"2017-05-17",null,null,null,null,null,null,null,null,null,null,51.199999999999903,"NO SATISFACTORIO"]
["Ajuste de compromisos","Cambio de evaluador",null,null,null,null,null,null,null,null,null,null,null,null,null,"2017-05-18",null,null,null,null,null,null,null,null,null,null,51.299999999999898,"NO SATISFACTORIO"]
["Cambio de evaluador","Interrupción del período de prueba por más de 20 días calendario",null,null,null,null,null,null,null,null,null,null,null,null,null,"2017-05-19",null,null,null,null,null,null,null,null,null,null,51.399999999999899,"NO SATISFACTORIO"]
["Cambio del empleo","Lapso entre la última evaluación y el final del período",null,null,null,null,null,null,null,null,null,null,null,null,null,"2017-05-20",null,null,null,null,null,null,null,null,null,null,51.499999999999901,"NO SATISFACTORIO"]
["Lapso entre la última evaluación y el final del período",null,null,null,null,null,null,null,null,null,null,null,null,null,null,"2017-05-21",null,null,null,null,null,null,null,null,null,null,51.599999999999902,"NO SATISFACTORIO"]
["Por período de prueba en otro empleo",null,null,null,null,null,null,null,null,null,null,null,null,null,null,"2017-05-22",null,null,null,null,null,null,null,null,null,null,51.699999999999903,"NO SATISFACTORIO"]
["Separación temporal del empleo por más de 30 días calendario",null,null,null,null,null,null,null,null,null,null,null,null,null,null,"2017-05-23",null,null,null,null,null,null,null,null,null,null,51.799999999999898,"NO SATISFACTORIO"]
[null,null,null,null,null,null,null,null,null,null,null,null,null,null,null,"2017-05-24",null,null,null,null,null,null,null,null,null,null,51.8999999999998,"NO SATISFACTORIO"]
[null,null,null,null,null,null,null,null,null,null,null,null,null,null,null,"2017-05-25",null,null,null,null,null,null,null,null,null,null,51.999999999999901,"NO SATISFACTORIO"]
[null,null,null,null,null,null,null,null,null,null,null,null,null,null,null,"2017-05-26",null,null,null,null,null,null,null,null,null,null,52.099999999999902,"NO SATISFACTORIO"]
[null,null,null,null,null,null,null,null,null,null,null,null,null,null,null,"2017-05-27",null,null,null,null,null,null,null,null,null,null,52.199999999999903,"NO SATISFACTORIO"]
[null,null,null,null,null,null,null,null,null,null,null,null,null,null,null,"2017-05-28",null,null,null,null,null,null,null,null,null,null,52.299999999999898,"NO SATISFACTORIO"]
[null,null,null,null,null,null,null,null,null,null,null,null,null,null,null,"2017-05-29",null,null,null,null,null,null,null,null,null,null,52.3999999999998,"NO SATISFACTORIO"]
[null,null,null,null,null,null,null,null,null,null,null,null,null,null,null,"2017-05-30",null,null,null,null,null,null,null,null,null,null,52.499999999999901,"NO SATISFACTORIO"]
["PERIODO SEMESTRAL","CALIFICACION LABORALES","TIEMPO","% TOTAL TIEMPO","CALIFICACIÓN COMPORTAMENTALES",null,null,null,null,null,null,null,null,null,null,"2017-05-31",null,null,null,null,null,null,null,null,null,null,52.599999999999902,"NO SATISFACTORIO"]
["PRIMER SEMESTRE",{"$f":"'F1. INF. GENERAL'!O34","v":0},{"$f":"'F1. INF. GENERAL'!L35","v":0},{"$f":"+C526/C528","v":{"$error":"#DIV/0!"}},{"$f":"'F1. INF. GENERAL'!F44","v":0},null,null,null,null,null,null,null,null,null,null,"2017-06-01",null,null,null,null,null,null,null,null,null,null,52.699999999999797,"NO SATISFACTORIO"]
["SEGUNDO SEMESTRE",{"$f":"'F1. INF. GENERAL'!S34","v":0},{"$f":"'F1. INF. GENERAL'!P35","v":0},{"$f":"+C527/C528","v":{"$error":"#DIV/0!"}},{"$f":"'F1. INF. GENERAL'!H44:I45","v":{"$error":"#VALUE!"}},null,null,null,null,null,null,null,null,null,null,"2017-06-02",null,null,null,null,null,null,null,null,null,null,52.799999999999798,"NO SATISFACTORIO"]
[null,null,{"$f":"SUM(C526:C527)","v":0},1]
[]
[]
[null,null,null,null,null,null,null,null,null,null,null,null,null,null,null,"2017-06-03",null,null,null,null,null,null,null,null,null,null,52.8999999999998,"NO SATISFACTORIO"]
["PARCIALES EVENTAULES","CALIFICACION LABORALES","TIEMPO",null,"CALIFICACIÓN COMPORTAMENTALES",null,null,null,null,null,null,null,null,null,null,"2017-06-04",null,null,null,null,null,null,null,null,null,null,52.999999999999901,"NO SATISFACTORIO"]
["PRIMER SEMESTRE",{"$f":"'[3]F8. EVA. EVENTUAL (Semestre 1)'!K48","v":0},{"$f":"'[3]F8. EVA. EVENTUAL (Semestre 1)'!L46","v":"No Aplica"},{"$f":"+C533/C535","v":{"$error":"#VALUE!"}},{"$f":"'[3]F8. EVA. EVENTUAL (Semestre 1)'!M62","v":0},null,null,null,null,null,null,null,null,null,null,"2017-06-05",null,null,null,null,null,null,null,null,null,null,53.099999999999902,"NO SATISFACTORIO"]
["SEGUNDO SEMESTRE",{"$f":"'[3]F8. EVA. EVENTUAL (Semestre 2)'!K47","v":0},{"$f":"'[3]F8. EVA. EVENTUAL (Semestre 2)'!L45","v":"No Aplica"},{"$f":"+C534/C535","v":{"$error":"#VALUE!"}},{"$f":"'[3]F8. EVA. EVENTUAL (Semestre 2)'!M61","v":0},null,null,null,null,null,null,null,null,null,null,"2017-06-06",null,null,null,null,null,null,null,null,null,null,53.199999999999797,"NO SATISFACTORIO"]
[null,null,{"$f":"SUM(C533:C534)","v":0},1,null,null,null,null,null,null,null,null,null,null,null,"2017-06-07",null,null,null,null,null,null,null,null,null,null,53.299999999999798,"NO SATISFACTORIO"]
[null,null,null,null,null,null,null,null,null,null,null,null,null,null,null,"2017-06-08",null,null,null,null,null,null,null,null,null,null,53.3999999999998,"NO SATISFACTORIO"]
[null,null,null,null,null,null,null,null,null,null,null,null,null,null,null,"2017-06-09",null,null,null,null,null,null,null,null,null,null,53.499999999999801,"NO SATISFACTORIO"]
[null,null,"TIEMPO",null,null,null,null,null,null,null,null,null,null,null,null,"2017-06-10",null,null,null,null,null,null,null,null,null,null,53.599999999999802,"NO SATISFACTORIO"]
[null,"Primer Semestre",{"$f":"C526","v":0},{"$f":"+C539/$C$541","v":{"$error":"#DIV/0!"}},null,null,null,null,null,null,null,null,null,null,null,"2017-06-11",null,null,null,null,null,null,null,null,null,null,53.699999999999797,"NO SATISFACTORIO"]
[null,"Segundo Semestre",{"$f":"+C527","v":0},{"$f":"+C540/$C$541","v":{"$error":"#DIV/0!"}},null,null,null,null,null,null,null,null,null,null,null,"2017-06-12",null,null,null,null,null,null,null,null,null,null,53.799999999999798,"NO SATISFACTORIO"]
[null,"TOTAL TIEMPO",{"$f":"SUM(C539:C540)","v":0},null,null,null,null,null,null,null,null,null,null,null,null,"2017-06-13",null,null,null,null,null,null,null,null,null,null,53.8999999999998,"NO SATISFACTORIO"]
[null,null,null,null,null,null,null,null,null,null,null,null,null,null,null,"2017-06-14",null,null,null,null,null,null,null,null,null,null,53.999999999999801,"NO SATISFACTORIO"]
[null,null,null,null,null,null,null,null,null,null,null,null,null,null,null,"2017-06-15",null,null,null,null,null,null,null,null,null,null,54.099999999999802,"NO SATISFACTORIO"]
[null,null,null,null,null,null,null,null,null,null,null,null,null,null,null,"2017-06-16",null,null,null,null,null,null,null,null,null,null,54.199999999999797,"NO SATISFACTORIO"]
[null,null,null,null,null,null,null,null,null,null,null,null,null,null,null,"2017-06-17",null,null,null,null,null,null,null,null,null,null,54.299999999999798,"NO SATISFACTORIO"]
[null,null,null,null,null,null,null,null,null,null,null,null,null,null,null,"2017-06-18",null,null,null,null,null,null,null,null,null,null,54.3999999999998,"NO SATISFACTORIO"]
[null,null,null,null,null,null,null,null,null,null,null,null,null,null,null,"2017-06-19",null,null,null,null,null,null,null,null,null,null,54.499999999999801,"NO SATISFACTORIO"]
[null,null,null,null,null,null,null,null,null,null,null,null,null,null,null,"2017-06-20",null,null,null,null,null,null,null,null,null,null,54.599999999999802,"NO SATISFACTORIO"]
[null,null,null,null,null,null,null,null,null,null,null,null,null,null,null,"2017-06-21",null,null,null,null,null,null,null,null,null,null,54.699999999999797,"NO SATISFACTORIO"]
[null,null,null,null,null,null,null,null,null,null,null,null,null,null,null,"2017-06-22",null,null,null,null,null,null,null,null,null,null,54.799999999999798,"NO SATISFACTORIO"]
[null,null,null,null,null,null,null,null,null,null,null,null,null,null,null,"2017-06-23",null,null,null,null,null,null,null,null,null,null,54.8999999999998,"NO SATISFACTORIO"]
[null,null,null,null,null,null,null,null,null,null,null,null,null,null,null,"2017-06-24",null,null,null,null,null,null,null,null,null,null,54.999999999999801,"NO SATISFACTORIO"]
[null,null,null,null,null,null,null,null,null,null,null,null,null,null,null,"2017-06-25",null,null,null,null,null,null,null,null,null,null,55.099999999999802,"NO SATISFACTORIO"]
[null,null,null,null,null,null,null,null,null,null,null,null,null,null,null,"2017-06-26",null,null,null,null,null,null,null,null,null,null,55.199999999999797,"NO SATISFACTORIO"]
[null,null,null,null,null,null,null,null,null,null,null,null,null,null,null,"2017-06-27",null,null,null,null,null,null,null,null,null,null,55.299999999999798,"NO SATISFACTORIO"]
[null,null,null,null,null,null,null,null,null,null,null,null,null,null,null,"2017-06-28",null,null,null,null,null,null,null,null,null,null,55.3999999999998,"NO SATISFACTORIO"]
[null,null,null,null,null,null,null,null,null,null,null,null,null,null,null,"2017-06-29",null,null,null,null,null,null,null,null,null,null,55.499999999999801,"NO SATISFACTORIO"]
[null,null,null,null,null,null,null,null,null,null,null,null,null,null,null,"2017-06-30",null,null,null,null,null,null,null,null,null,null,55.599999999999802,"NO SATISFACTORIO"]
[null,null,null,null,null,null,null,null,null,null,null,null,null,null,null,"2017-07-01",null,null,null,null,null,null,null,null,null,null,55.699999999999797,"NO SATISFACTORIO"]
[null,null,null,null,null,null,null,null,null,null,null,null,null,null,null,"2017-07-02",null,null,null,null,null,null,null,null,null,null,55.799999999999798,"NO SATISFACTORIO"]
[null,null,null,null,null,null,null,null,null,null,null,null,null,null,null,"2017-07-03",null,null,null,null,null,null,null,null,null,null,55.8999999999998,"NO SATISFACTORIO"]
[null,null,null,null,null,null,null,null,null,null,null,null,null,null,null,"2017-07-04",null,null,null,null,null,null,null,null,null,null,55.999999999999801,"NO SATISFACTORIO"]
[null,null,null,null,null,null,null,null,null,null,null,null,null,null,null,"2017-07-05",null,null,null,null,null,null,null,null,null,null,56.099999999999802,"NO SATISFACTORIO"]
[null,null,null,null,null,null,null,null,null,null,null,null,null,null,null,"2017-07-06",null,null,null,null,null,null,null,null,null,null,56.199999999999797,"NO SATISFACTORIO"]
[null,null,null,null,null,null,null,null,null,null,null,null,null,null,null,"2017-07-07",null,null,null,null,null,null,null,null,null,null,56.299999999999798,"NO SATISFACTORIO"]
[null,null,null,null,null,null,null,null,null,null,null,null,null,null,null,"2017-07-08",null,null,null,null,null,null,null,null,null,null,56.3999999999998,"NO SATISFACTORIO"]
[null,null,null,null,null,null,null,null,null,null,null,null,null,null,null,"2017-07-09",null,null,null,null,null,null,null,null,null,null,56.499999999999801,"NO SATISFACTORIO"]
[null,null,null,null,null,null,null,null,null,null,null,null,null,null,null,"2017-07-10",null,null,null,null,null,null,null,null,null,null,56.599999999999802,"NO SATISFACTORIO"]
[null,null,null,null,null,null,null,null,null,null,null,null,null,null,null,"2017-07-11",null,null,null,null,null,null,null,null,null,null,56.699999999999797,"NO SATISFACTORIO"]
[null,null,null,null,null,null,null,null,null,null,null,null,null,null,null,"2017-07-12",null,null,null,null,null,null,null,null,null,null,56.799999999999798,"NO SATISFACTORIO"]
[null,null,null,null,null,null,null,null,null,null,null,null,null,null,null,"2017-07-13",null,null,null,null,null,null,null,null,null,null,56.8999999999998,"NO SATISFACTORIO"]
[null,null,null,null,null,null,null,null,null,null,null,null,null,null,null,"2017-07-14",null,null,null,null,null,null,null,null,null,null,56.999999999999801,"NO SATISFACTORIO"]
[null,null,null,null,null,null,null,null,null,null,null,null,null,null,null,"2017-07-15",null,null,null,null,null,null,null,null,null,null,57.099999999999802,"NO SATISFACTORIO"]
[null,null,null,null,null,null,null,null,null,null,null,null,null,null,null,"2017-07-16",null,null,null,null,null,null,null,null,null,null,57.199999999999797,"NO SATISFACTORIO"]
[null,null,null,null,null,null,null,null,null,null,null,null,null,null,null,"2017-07-17",null,null,null,null,null,null,null,null,null,null,57.299999999999798,"NO SATISFACTORIO"]
[null,null,null,null,null,null,null,null,null,null,null,null,null,null,null,"2017-07-18",null,null,null,null,null,null,null,null,null,null,57.3999999999998,"NO SATISFACTORIO"]
[null,null,null,null,null,null,null,null,null,null,null,null,null,null,null,"2017-07-19",null,null,null,null,null,null,null,null,null,null,57.499999999999801,"NO SATISFACTORIO"]
[null,null,null,null,null,null,null,null,null,null,null,null,null,null,null,"2017-07-20",null,null,null,null,null,null,null,null,null,null,57.599999999999802,"NO SATISFACTORIO"]
[null,null,null,null,null,null,null,null,null,null,null,null,null,null,null,"2017-07-21",null,null,null,null,null,null,null,null,null,null,57.699999999999797,"NO SATISFACTORIO"]
[null,null,null,null,null,null,null,null,null,null,null,null,null,null,null,"2017-07-22",null,null,null,null,null,null,null,null,null,null,57.799999999999798,"NO SATISFACTORIO"]
[null,null,null,null,null,null,null,null,null,null,null,null,null,null,null,"2017-07-23",null,null,null,null,null,null,null,null,null,null,57.8999999999998,"NO SATISFACTORIO"]
[null,null,null,null,null,null,null,null,null,null,null,null,null,null,null,"2017-07-24",null,null,null,null,null,null,null,null,null,null,57.999999999999801,"NO SATISFACTORIO"]
[null,null,null,null,null,null,null,null,null,null,null,null,null,null,null,"2017-07-25",null,null,null,null,null,null,null,null,null,null,58.099999999999802,"NO SATISFACTORIO"]
[null,null,null,null,null,null,null,null,null,null,null,null,null,null,null,"2017-07-26",null,null,null,null,null,null,null,null,null,null,58.199999999999797,"NO SATISFACTORIO"]
[null,null,null,null,null,null,null,null,null,null,null,null,null,null,null,"2017-07-27",null,null,null,null,null,null,null,null,null,null,58.299999999999798,"NO SATISFACTORIO"]
[null,null,null,null,null,null,null,null,null,null,null,null,null,null,null,"2017-07-28",null,null,null,null,null,null,null,null,null,null,58.3999999999998,"NO SATISFACTORIO"]
[null,null,null,null,null,null,null,null,null,null,null,null,null,null,null,"2017-07-29",null,null,null,null,null,null,null,null,null,null,58.499999999999801,"NO SATISFACTORIO"]
[null,null,null,null,null,null,null,null,null,null,null,null,null,null,null,"2017-07-30",null,null,null,null,null,null,null,null,null,null,58.599999999999802,"NO SATISFACTORIO"]
[null,null,null,null,null,null,null,null,null,null,null,null,null,null,null,"2017-07-31",null,null,null,null,null,null,null,null,null,null,58.699999999999797,"NO SATISFACTORIO"]
[null,null,null,null,null,null,null,null,null,null,null,null,null,null,null,"2017-08-01",null,null,null,null,null,null,null,null,null,null,58.799999999999798,"NO SATISFACTORIO"]
[null,null,null,null,null,null,null,null,null,null,null,null,null,null,null,"2017-08-02",null,null,null,null,null,null,null,null,null,null,58.8999999999998,"NO SATISFACTORIO"]
[null,null,null,null,null,null,null,null,null,null,null,null,null,null,null,"2017-08-03",null,null,null,null,null,null,null,null,null,null,58.999999999999801,"NO SATISFACTORIO"]
[null,null,null,null,null,null,null,null,null,null,null,null,null,null,null,"2017-08-04",null,null,null,null,null,null,null,null,null,null,59.099999999999802,"NO SATISFACTORIO"]
[null,null,null,null,null,null,null,null,null,null,null,null,null,null,null,"2017-08-05",null,null,null,null,null,null,null,null,null,null,59.199999999999797,"NO SATISFACTORIO"]
[null,null,null,null,null,null,null,null,null,null,null,null,null,null,null,"2017-08-06",null,null,null,null,null,null,null,null,null,null,59.299999999999798,"NO SATISFACTORIO"]
[null,null,null,null,null,null,null,null,null,null,null,null,null,null,null,"2017-08-07",null,null,null,null,null,null,null,null,null,null,59.3999999999998,"NO SATISFACTORIO"]
[null,null,null,null,null,null,null,null,null,null,null,null,null,null,null,"2017-08-08",null,null,null,null,null,null,null,null,null,null,59.499999999999801,"NO SATISFACTORIO"]
[null,null,null,null,null,null,null,null,null,null,null,null,null,null,null,"2017-08-09",null,null,null,null,null,null,null,null,null,null,59.599999999999802,"NO SATISFACTORIO"]
[null,null,null,null,null,null,null,null,null,null,null,null,null,null,null,"2017-08-10",null,null,null,null,null,null,null,null,null,null,59.699999999999797,"NO SATISFACTORIO"]
["NIVEL","Competencia","Concatenar","Definición de la competencia","Conductas asociadas",null,null,null,null,null,null,null,null,null,null,"2017-08-11",null,null,null,null,null,null,null,null,null,null,59.799999999999798,"NO SATISFACTORIO"]
["ASESOR","Orientación a resultados ",{"$f":"A601&B601","v":"ASESOROrientación a resultados "},"Realizar las funciones y cumplir los compromisos organizacionales con eficacia y calidad. ","▪ Cumple con oportunidad en función de estándares, objetivos y metas establecidas por la entidad, las funciones que le son asignadas.\n▪ Asume la responsabilidad por sus resultados.\n▪ Compromete recursos y tiempos para mejorar la productividad tomando las medidas necesarias para minimizar los riesgos.\n▪ Realiza todas las acciones necesarias para alcanzar los objetivos propuestos enfrentando los obstáculos que se presentan.",null,null,null,null,null,null,null,null,null,null,"2017-08-12",null,null,null,null,null,null,null,null,null,null,59.8999999999998,"NO SATISFACTORIO"]
["ASESOR","Orientación al usuario y al ciudadano",{"$f":"A602&B602","v":"ASESOROrientación al usuario y al ciudadano"},"Dirigir las decisiones y acciones a la satisfacción de las necesidades e intereses de los usuarios internos y externos, de conformidad con las responsabilidades públicas asignadas a la entidad.","▪ Atiende y valora las necesidades y peticiones de los usuarios y de ciudadanos en general.\n▪Considera las necesidades de los usuarios al diseñar proyectos o servicios.\n▪Da respuesta oportuna a las necesidades de los usuarios de conformidad con el servicio que ofrece la entidad.\n▪Establece diferentes canales de comunicación con el usuario para conocer sus necesidades y propuestas y responde a las mismas.\n▪Reconoce la interdependencia entre su trabajo y el de otros.",null,null,null,null,null,null,null,null,null,null,"2017-08-13",null,null,null,null,null,null,null,null,null,null,59.999999999999801,"NO SATISFACTORIO"]
["ASESOR","Compromiso con la Organización","ASESORCompromiso con la Organización","Alinear el propio comportamiento a las necesidades, prioridades y metas organizacionales.","▪Promueve las metas de la organización y respeta sus normas.\n▪Antepone las necesidades de la organización a sus propias necesidades.\n▪Apoya a la organización en situaciones difíciles.\n▪Demuestra sentido de pertenencia en todas sus actuaciones.",null,null,null,null,null,null,null,null,null,null,"2017-08-14",null,null,null,null,null,null,null,null,null,null,60.099999999999802,"NO SATISFACTORIO"]
["ASESOR","Experticia profesional","ASESORExperticia profesional","Aplicar el conocimiento profesional","▪Orienta el desarrollo de proyectos especiales para el logro de resultados de la alta dirección.\n▪Aconseja y orienta la toma de decisiones en los temas que le han sido asignados.\n▪Asesora en materias propias de su campo de conocimiento, emitiendo conceptos, juicios o propuestas ajustados a lineamientos teóricos y técnicos.\n▪Se comunica de modo lógico, claro, efectivo y seguro.",null,null,null,null,null,null,null,null,null,null,"2017-08-15",null,null,null,null,null,null,null,null,null,null,60.199999999999797,"NO SATISFACTORIO"]
["ASESOR","Conocimiento del entorno","ASESORConocimiento del entorno","Conocer e interpretar la organización, su funcionamiento y sus relaciones políticas y administrativas.","▪Comprende el entorno organizacional que enmarca las situaciones objeto de asesoría y lo toma como referente obligado para emitir juicios, conceptos o propuestas a desarrollar.\n▪Se informa permanentemente sobre políticas gubernamentales, problemas y demandas del entorno.",null,null,null,null,null,null,null,null,null,null,"2017-08-16",null,null,null,null,null,null,null,null,null,null,60.299999999999798,"NO SATISFACTORIO"]
["ASESOR","Construcción de relaciones","ASESORConstrucción de relaciones","Establecer y mantener relaciones cordiales y recíprocas con redes o grupos de personas internas y externas a la organización que faciliten la consecución de los objetivos institucionales.","▪Utiliza sus contactos para conseguir objetivos.\n▪Comparte información para establecer lazos.\n▪Interactúa con otros de un modo efectivo y adecuado.",null,null,null,null,null,null,null,null,null,null,"2017-08-17",null,null,null,null,null,null,null,null,null,null,60.3999999999998,"NO SATISFACTORIO"]
["ASESOR","Iniciativa","ASESORIniciativa","Anticiparse a los problemas iniciando acciones para superar los obstáculos y alcanzar metas concretas","▪Prevé situaciones y alternativas de solución que orientan la toma de decisiones de la alta dirección.\n▪Enfrenta los problemas y propone acciones concretas para solucionarlos.\n▪Reconoce y hace viables las oportunidades.",null,null,null,null,null,null,null,null,null,null,"2017-08-18",null,null,null,null,null,null,null,null,null,null,60.499999999999801,"NO SATISFACTORIO"]
["PROFESIONAL","Orientación a resultados ","PROFESIONALOrientación a resultados ","Realizar las funciones y cumplir los compromisos organizacionales con eficacia y calidad. ","▪ Cumple con oportunidad en función de estándares, objetivos y metas establecidas por la entidad, las funciones que le son asignadas.\n▪ Asume la responsabilidad por sus resultados.\n▪ Compromete recursos y tiempos para mejorar la productividad tomando las medidas necesarias para minimizar los riesgos.\n▪ Realiza todas las acciones necesarias para alcanzar los objetivos propuestos enfrentando los obstáculos que se presentan.",null,null,null,null,null,null,null,null,null,null,"2017-08-19",null,null,null,null,null,null,null,null,null,null,60.599999999999802,"NO SATISFACTORIO"]
["PROFESIONAL","Orientación al usuario y al ciudadano","PROFESIONALOrientación al usuario y al ciudadano","Dirigir las decisiones y acciones a la satisfacción de las necesidades e intereses de los usuarios internos y externos, de conformidad con las responsabilidades públicas asignadas a la entidad.","▪ Atiende y valora las necesidades y peticiones de los usuarios y de ciudadanos en general.\n▪Considera las necesidades de los usuarios al diseñar proyectos o servicios.\n▪Da respuesta oportuna a las necesidades de los usuarios de conformidad con el servicio que ofrece la entidad.\n▪Establece diferentes canales de comunicación con el usuario para conocer sus necesidades y propuestas y responde a las mismas.\n▪Reconoce la interdependencia entre su trabajo y el de otros.",null,null,null,null,null,null,null,null,null,null,"2017-08-20",null,null,null,null,null,null,null,null,null,null,60.699999999999797,"NO SATISFACTORIO"]
["PROFESIONAL","Compromiso con la Organización","PROFESIONALCompromiso con la Organización","Alinear el propio comportamiento a las necesidades, prioridades y metas organizacionales.","▪Promueve las metas de la organización y respeta sus normas.\n▪Antepone las necesidades de la organización a sus propias necesidades.\n▪Apoya a la organización en situaciones difíciles.\n▪Demuestra sentido de pertenencia en todas sus actuaciones.",null,null,null,null,null,null,null,null,null,null,"2017-08-21",null,null,null,null,null,null,null,null,null,null,60.799999999999798,"NO SATISFACTORIO"]
["PROFESIONAL","Aprendizaje Continuo","PROFESIONALAprendizaje Continuo","Adquirir y desarrollar permanentemente conocimientos, destrezas y habilidades, con el fin de mantener altos estándares de eficacia organizacional.","▪Aprende de la experiencia de otros y de la propia.\n▪Se adapta y aplica nuevas tecnologías que se implanten en la organización.\n▪Aplica los conocimientos adquiridos a los desafíos que se presentan en el desarrollo del trabajo.\n▪Investiga, indaga y profundiza en los temas de su entorno área de desempeño.\n▪Reconoce las propias limitaciones y las necesidades de mejorar su preparación.\n▪Asimila nueva información y la aplica correctamente.",null,null,null,null,null,null,null,null,null,null,"2017-08-22",null,null,null,null,null,null,null,null,null,null,60.8999999999998,"NO SATISFACTORIO"]
["PROFESIONAL","Experticia profesional","PROFESIONALExperticia profesional","Aplicar el conocimiento profesional en la resolución de problemas y transferirlo a su entorno laboral.","▪Analiza de un modo sistemático y racional los aspectos del trabajo, basándose en la información relevante.\n▪Aplica reglas básicas y conceptos complejos aprendidos\n▪Identifica y reconoce con facilidad las causas de los problemas y sus soluciones.\n▪Clarifica datos o situaciones complejas.\n▪Planea, organiza y ejecuta múltiples tareas tendientes a alcanzar resultados institucionales.",null,null,null,null,null,null,null,null,null,null,"2017-08-23",null,null,null,null,null,null,null,null,null,null,60.999999999999801,"NO SATISFACTORIO"]
["PROFESIONAL","Trabajo en equipo y Colaboración","PROFESIONALTrabajo en equipo y Colaboración","Trabajar con otros de forma conjunta y de manera participativa, integrando esfuerzos para la consecución de metas institucionales comunes.","▪Coopera en distintas situaciones y comparte información.\n▪Aporta sugerencias, ideas y opiniones.\n▪Expresa expectativas positivas del equipo o de los miembros del mismo.\n▪Planifica las propias acciones teniendo en cuenta la repercusión de las mismas para la consecución de los objetivos grupales.\n▪Establece diálogo directo con los miembros del equipo que permita compartir información e ideas en condiciones de respeto y cordialidad.\n▪Respeta criterios dispares y distintas opiniones del equipo.",null,null,null,null,null,null,null,null,null,null,"2017-08-24",null,null,null,null,null,null,null,null,null,null,61.099999999999802,"NO SATISFACTORIO"]
["PROFESIONAL","Creatividad e Innovación","PROFESIONALCreatividad e Innovación","Generar y desarrollar nuevas ideas, conceptos, métodos y soluciones.","▪Ofrece respuestas alternativas.\n▪Aprovecha las oportunidades y problemas para dar soluciones novedosas.\n▪Desarrolla nuevas formas de hacer y tecnologías.\n▪Busca nuevas alternativas de solución y se arriesga a romper esquemas tradicionales.\n▪Inicia acciones para superar los obstáculos y alcanzar metas específicas.",null,null,null,null,null,null,null,null,null,null,"2017-08-25",null,null,null,null,null,null,null,null,null,null,61.199999999999797,"NO SATISFACTORIO"]
["PROFESIONAL","Liderazgo de Grupos de Trabajo (personal a cargo)","PROFESIONALLiderazgo de Grupos de Trabajo (personal a cargo)","Asumir el rol de orientar y guía de un grupo o equipo de trabajo, utilizando la autoridad con arreglo a las normas y promoviendo la Efectividad en la consecución de objetivos y metas institucionales.","▪Establece los objetivos del grupo de forma clara y equilibrada.\n▪Asegura que los integrantes del grupo compartan planes, programas y proyectos institucionales.\n▪Orienta y coordina el trabajo del grupo para la identificación de planes y actividades a seguir.\n▪Facilita la colaboración con otras áreas y dependencias.\n▪Escucha y tiene en cuenta las opiniones de los integrantes del grupo.\n▪Gestiona los recursos necesarios para poder cumplir con las metas propuestas.\n▪Garantiza los recursos necesarios para poder cumplir con las metas propuestas.\n▪Garantiza que el grupo tenga la información necesaria.\n▪Explica las razones de las decisiones.",null,null,null,null,null,null,null,null,null,null,"2017-08-26",null,null,null,null,null,null,null,null,null,null,61.299999999999798,"NO SATISFACTORIO"]
["PROFESIONAL","Toma de decisiones (personal a cargo)","PROFESIONALToma de decisiones (personal a cargo)","Elegir entre una o varias alternativas para solucionar un problema y tomar las acciones concretas y consecuentes con la elección realizada.","▪Elige alternativas de solución efectiva y suficiente para atender los asuntos encomendados.\n▪Decide y establece prioridades para el trabajo del grupo.\n▪Asume posiciones concretas para el manejo de temas o situaciones que demandan su atención.\n▪Efectúa cambios en las actividades o en la manera de desarrollar sus responsabilidades cuando detecta dificultades para su realización o mejores prácticas que pueden optimizar el desempeño.\n▪Asume las consecuencias de las decisiones adoptadas.\n▪Fomenta la participación en la toma de decisiones.",null,null,null,null,null,null,null,null,null,null,"2017-08-27",null,null,null,null,null,null,null,null,null,null,61.3999999999998,"NO SATISFACTORIO"]
["TECNICO","Orientación a resultados ","TECNICOOrientación a resultados ","Realizar las funciones y cumplir los compromisos organizacionales con eficacia y calidad. ","▪ Cumple con oportunidad en función de estándares, objetivos y metas establecidas por la entidad, las funciones que le son asignadas.\n▪ Asume la responsabilidad por sus resultados.\n▪ Compromete recursos y tiempos para mejorar la productividad tomando las medidas necesarias para minimizar los riesgos.\n▪ Realiza todas las acciones necesarias para alcanzar los objetivos propuestos enfrentando los obstáculos que se presentan.",null,null,null,null,null,null,null,null,null,null,"2017-08-28",null,null,null,null,null,null,null,null,null,null,61.499999999999801,"NO SATISFACTORIO"]
["TECNICO","Orientación al usuario y al ciudadano","TECNICOOrientación al usuario y al ciudadano","Dirigir las decisiones y acciones a la satisfacción de las necesidades e intereses de los usuarios internos y externos, de conformidad con las responsabilidades públicas asignadas a la entidad.","▪ Atiende y valora las necesidades y peticiones de los usuarios y de ciudadanos en general.\n▪Considera las necesidades de los usuarios al diseñar proyectos o servicios.\n▪Da respuesta oportuna a las necesidades de los usuarios de conformidad con el servicio que ofrece la entidad.\n▪Establece diferentes canales de comunicación con el usuario para conocer sus necesidades y propuestas y responde a las mismas.\n▪Reconoce la interdependencia entre su trabajo y el de otros.",null,null,null,null,null,null,null,null,null,null,"2017-08-29",null,null,null,null,null,null,null,null,null,null,61.599999999999802,"NO SATISFACTORIO"]
["TECNICO","Compromiso con la Organización","TECNICOCompromiso con la Organización","Alinear el propio comportamiento a las necesidades, prioridades y metas organizacionales.","▪Promueve las metas de la organización y respeta sus normas.\n▪Antepone las necesidades de la organización a sus propias necesidades.\n▪Apoya a la organización en situaciones difíciles.\n▪Demuestra sentido de pertenencia en todas sus actuaciones.",null,null,null,null,null,null,null,null,null,null,"2017-08-30",null,null,null,null,null,null,null,null,null,null,61.699999999999797,"NO SATISFACTORIO"]
["TECNICO","Experticia Técnica","TECNICOExperticia Técnica","Entender y aplicar los conocimientos técnicos del área de desempeño y mantenerlos actualizados","▪Capta y asimila con facilidad conceptos e información.\n▪Aplica el conocimiento técnico a las actividades cotidianas.\n▪Analiza la información de acuerdo con las necesidades de la organización.\n▪Comprende los aspectos técnicos y los aplica al desarrollo de procesos y procedimientos en los que está involucrado.\n▪Resuelve problemas utilizando sus conocimientos técnicos de su especialidad y garantizando indicadores y estándares establecidos.",null,null,null,null,null,null,null,null,null,null,"2017-08-31",null,null,null,null,null,null,null,null,null,null,61.799999999999798,"NO SATISFACTORIO"]
["TECNICO","Trabajo en equipo","TECNICOTrabajo en equipo","Trabajar con otros para conseguir metas comunes","▪Identifica claramente los objetivos del grupo y orienta su trabajo a la consecución de los mismos.\n▪Colabora con otros para la realización de actividades y metas grupales.",null,null,null,null,null,null,null,null,null,null,"2017-09-01",null,null,null,null,null,null,null,null,null,null,61.8999999999998,"NO SATISFACTORIO"]
["TECNICO","Creatividad e innovación","TECNICOCreatividad e innovación","Presentar ideas y métodos novedosos y concretarlos en acciones","▪Propone y encuentra formas nuevas y eficaces de hacer las cosas.\n▪Es recursivo.\n▪Es práctico.\n▪Busca nuevas alternativas de solución.\n▪Revisa permanentemente los procesos y procedimientos para optimizar los resultados.",null,null,null,null,null,null,null,null,null,null,"2017-09-02",null,null,null,null,null,null,null,null,null,null,61.999999999999801,"NO SATISFACTORIO"]
["ASISTENCIAL","Orientación a resultados ","ASISTENCIALOrientación a resultados ","Realizar las funciones y cumplir los compromisos organizacionales con eficacia y calidad. ","▪ Cumple con oportunidad en función de estándares, objetivos y metas establecidas por la entidad, las funciones que le son asignadas.\n▪ Asume la responsabilidad por sus resultados.\n▪ Compromete recursos y tiempos para mejorar la productividad tomando las medidas necesarias para minimizar los riesgos.\n▪ Realiza todas las acciones necesarias para alcanzar los objetivos propuestos enfrentando los obstáculos que se presentan.",null,null,null,null,null,null,null,null,null,null,"2017-09-03",null,null,null,null,null,null,null,null,null,null,62.099999999999802,"NO SATISFACTORIO"]
["ASISTENCIAL","Orientación al usuario y al ciudadano","ASISTENCIALOrientación al usuario y al ciudadano","Dirigir las decisiones y acciones a la satisfacción de las necesidades e intereses de los usuarios internos y externos, de conformidad con las responsabilidades públicas asignadas a la entidad.","▪ Atiende y valora las necesidades y peticiones de los usuarios y de ciudadanos en general.\n▪Considera las necesidades de los usuarios al diseñar proyectos o servicios.\n▪Da respuesta oportuna a las necesidades de los usuarios de conformidad con el servicio que ofrece la entidad.\n▪Establece diferentes canales de comunicación con el usuario para conocer sus necesidades y propuestas y responde a las mismas.\n▪Reconoce la interdependencia entre su trabajo y el de otros.",null,null,null,null,null,null,null,null,null,null,"2017-09-04",null,null,null,null,null,null,null,null,null,null,62.199999999999797,"NO SATISFACTORIO"]
["ASISTENCIAL","Compromiso con la Organización","ASISTENCIALCompromiso con la Organización","Alinear el propio comportamiento a las necesidades, prioridades y metas organizacionales.","▪Promueve las metas de la organización y respeta sus normas.\n▪Antepone las necesidades de la organización a sus propias necesidades.\n▪Apoya a la organización en situaciones difíciles.\n▪Demuestra sentido de pertenencia en todas sus actuaciones.",null,null,null,null,null,null,null,null,null,null,"2017-09-05",null,null,null,null,null,null,null,null,null,null,62.299999999999798,"NO SATISFACTORIO"]
["ASISTENCIAL","Manejo de la información","ASISTENCIALManejo de la información","Manejar con respeto las informaciones personales e institucionales de que dispone.","▪Evade temas que indagan sobre información confidencial.\n▪Recoge sólo información imprescindible para el desarrollo de la tarea.\n▪Organiza y guarda de forma adecuada la información a su cuidado, teniendo en cuenta las normas legales y de la organización.\n▪No hace pública información laboral o de las personas que pueda afectar la organización o las personas.",null,null,null,null,null,null,null,null,null,null,"2017-09-06",null,null,null,null,null,null,null,null,null,null,62.3999999999998,"NO SATISFACTORIO"]
["ASISTENCIAL","Adaptación al cambio","ASISTENCIALAdaptación al cambio","Enfrentarse con flexibilidad y versatilidad a situaciones nuevas para aceptar los cambios positiva y constructivamente.","▪Acepta y se adapta fácilmente los cambios.\n▪Responde al cambio con flexibilidad.\n▪Promueve el cambio.",null,null,null,null,null,null,null,null,null,null,"2017-09-07",null,null,null,null,null,null,null,null,null,null,62.499999999999801,"NO SATISFACTORIO"]
["ASISTENCIAL","Disciplina","ASISTENCIALDisciplina","Adaptarse a las políticas institucionales y buscar información de los cambios en la autoridad competente.","▪Acepta instrucciones aunque se difiera de ellas.\n▪Realiza los cometidos y tareas del puesto de trabajo.\n▪Acepta la supervisión constante.\n▪Realiza funciones orientadas a apoyar la acción de otros miembros de la organización.",null,null,null,null,null,null,null,null,null,null,"2017-09-08",null,null,null,null,null,null,null,null,null,null,62.599999999999802,"NO SATISFACTORIO"]
["ASISTENCIAL","Relaciones Interpersonales","ASISTENCIALRelaciones Interpersonales","Establecer y mantener relaciones de trabajo amistosas y positivas, basadas en la comunicación abierta y fluida y en el respeto por los demás.","▪Escucha con interés a las personas y capta las preocupaciones, intereses y necesidades de los demás.\n▪Transmite eficazmente las ideas, sentimientos e información impidiendo con ello malos entendidos o situaciones confusas que puedan generar conflictos.",null,null,null,null,null,null,null,null,null,null,"2017-09-09",null,null,null,null,null,null,null,null,null,null,62.699999999999797,"NO SATISFACTORIO"]
["ASISTENCIAL","Colaboración","ASISTENCIALColaboración","Cooperar con los demás con el fin de alcanzar los objetivos institucionales","▪Ayuda al logro de los objetivos articulando sus actuaciones con los demás.\n▪Cumple los compromisos que adquiere.\n▪Facilita la labor de sus superiores y compañeros de trabajo.",null,null,null,null,null,null,null,null,null,null,"2017-09-10",null,null,null,null,null,null,null,null,null,null,62.799999999999798,"NO SATISFACTORIO"]
["DIRECTIVO","Orientación a resultados ",{"$f":"A631&B631","v":"DIRECTIVOOrientación a resultados "},"Realizar las funciones y cumplir los compromisos organizacionales con eficacia y calidad. ","▪ Cumple con oportunidad en función de estándares, objetivos y metas establecidas por la entidad, las funciones que le son asignadas.\n▪ Asume la responsabilidad por sus resultados.\n▪ Compromete recursos y tiempos para mejorar la productividad tomando las medidas necesarias para minimizar los riesgos.\n▪ Realiza todas las acciones necesarias para alcanzar los objetivos propuestos enfrentando los obstáculos que se presentan.",null,null,null,null,null,null,null,null,null,null,"2017-09-11",null,null,null,null,null,null,null,null,null,null,62.8999999999998,"NO SATISFACTORIO"]
["DIRECTIVO","Orientación al usuario y al ciudadano",{"$f":"A632&B632","v":"DIRECTIVOOrientación al usuario y al ciudadano"},"Dirigir las decisiones y acciones a la satisfacción de las necesidades e intereses de los usuarios internos y externos, de conformidad con las responsabilidades públicas asignadas a la entidad.","▪ Atiende y valora las necesidades y peticiones de los usuarios y de ciudadanos en general.\n▪Considera las necesidades de los usuarios al diseñar proyectos o servicios.\n▪Da respuesta oportuna a las necesidades de los usuarios de conformidad con el servicio que ofrece la entidad.\n▪Establece diferentes canales de comunicación con el usuario para conocer sus necesidades y propuestas y responde a las mismas.\n▪Reconoce la interdependencia entre su trabajo y el de otros.",null,null,null,null,null,null,null,null,null,null,"2017-09-12",null,null,null,null,null,null,null,null,null,null,62.999999999999801,"NO SATISFACTORIO"]
["DIRECTIVO","Compromiso con la Organización","DIRECTIVOCompromiso con la Organización","Alinear el propio comportamiento a las necesidades, prioridades y metas organizacionales.","▪Promueve las metas de la organización y respeta sus normas.\n▪Antepone las necesidades de la organización a sus propias necesidades.\n▪Apoya a la organización en situaciones difíciles.\n▪Demuestra sentido de pertenencia en todas sus actuaciones.",null,null,null,null,null,null,null,null,null,null,"2017-09-13",null,null,null,null,null,null,null,null,null,null,63.099999999999802,"NO SATISFACTORIO"]
["DIRECTIVO","Liderazgo","DIRECTIVOLiderazgo","Guiar y dirigir grupos y establecer y mantener la cohesión de grupo necesaria para alcanzar los objetivos organizacionales.","• Mantiene a sus colaboradores motivados.\n• Fomenta la comunicación clara, directa y concreta.\n• Constituye y mantiene grupos de trabajo con un desempeño conforme a los estándares.\n• Promueve la eficacia del equipo.\n• Genera un clima positivo y de seguridad en sus colaboradores.\n• Fomenta la participación de todos en los procesos de reflexión y de toma de decisiones.\n• Unifica esfuerzos hacia objetivos y metas institucionales.",null,null,null,null,null,null,null,null,null,null,"2017-09-14",null,null,null,null,null,null,null,null,null,null,63.199999999999797,"NO SATISFACTORIO"]
["DIRECTIVO","Planeación","DIRECTIVOPlaneación","Determinar eficazmente las metas y prioridades institucionales, identificando las acciones, los responsables, los plazos y los recursos requeridos para alcanzarlas.","• Anticipa situaciones y escenarios futuros con acierto.\n• Establece objetivos claros y concisos, estructurados y coherentes con las metas organizacionales.\n• Traduce los objetivos estratégicos en planes prácticos y factibles.\n• Busca soluciones a los problemas.\n• Distribuye el tiempo con eficiencia.\n• Establece planes alternativos de acción.",null,null,null,null,null,null,null,null,null,null,"2017-09-15",null,null,null,null,null,null,null,null,null,null,63.299999999999798,"NO SATISFACTORIO"]
["DIRECTIVO","Toma de decisiones","DIRECTIVOToma de decisiones","Elegir entre una o varias alternativas para solucionar un problema o atender una situación, comprometiéndose con acciones concretas y consecuentes con la decisión.","• Elige con oportunidad, entre muchas alternativas, los proyectos a realizar.\n• Efectúa cambios complejos y comprometidos en sus actividades o en las funciones que tiene asignadas cuando detecta problemas o dificultades para su realización.\n• Decide bajo presión.\n• Decide en situaciones de alta complejidad e incertidumbre.",null,null,null,null,null,null,null,null,null,null,"2017-09-16",null,null,null,null,null,null,null,null,null,null,63.3999999999998,"NO SATISFACTORIO"]
["DIRECTIVO","Dirección y Desarrollo de Personal","DIRECTIVODirección y Desarrollo de Personal","Favorecer el aprendizaje y desarrollo de sus colaboradores, articulando las potencialidades y necesidades individuales con las de la organización para optimizar la calidad de las contribuciones de los equipos de trabajo y de las personas, en el cumplimiento de los objetivos y metas organizacionales presentes y futuras.","• Identifica necesidades de formación y capacitación y propone acciones para satisfacerlas.\n• Permite niveles de autonomía con el fin de estimular el desarrollo integral del empleado.\n• Delega de manera efectiva sabiendo cuando intervenir y cuando no hacerlo.\n• Hace uso de las habilidades y recurso de su grupo de trabajo para alcanzar las metas y los estándares de productividad.\n• Establece espacios regulares de retroalimentación y reconocimiento del desempeño y sabe manejar hábilmente el bajo desempeño.\n• Tiene en cuenta las opiniones de sus colaboradores.\n• Mantiene con sus colaboradores relaciones de respeto.",null,null,null,null,null,null,null,null,null,null,"2017-09-17",null,null,null,null,null,null,null,null,null,null,63.499999999999801,"NO SATISFACTORIO"]
["DIRECTIVO","Conocimiento del entorno","DIRECTIVOConocimiento del entorno","Estar al tanto de las circunstancias y las relaciones de poder que influyen en el entorno organizacional","• Es consciente de las condiciones específicas del entorno organizacional.\n• Está al día en los acontecimientos claves del sector y del Estado.\n• Conoce y hace seguimiento a las políticas gubernamentales.\n• Identifica las fuerzas políticas que afectan la organización y las posibles alianzas para cumplir con los propósitos organizacionales.",null,null,null,null,null,null,null,null,null,null,"2017-09-18",null,null,null,null,null,null,null,null,null,null,63.599999999999802,"NO SATISFACTORIO"]
[null,null,null,null,null,null,null,null,null,null,null,null,null,null,null,"2017-09-19",null,null,null,null,null,null,null,null,null,null,63.699999999999797,"NO SATISFACTORIO"]
[null,null,null,null,null,null,null,null,null,null,null,null,null,null,null,"2017-09-20",null,null,null,null,null,null,null,null,null,null,63.799999999999798,"NO SATISFACTORIO"]
[null,null,null,null,null,null,null,null,null,null,null,null,null,null,null,"2017-09-21",null,null,null,null,null,null,null,null,null,null,63.8999999999998,"NO SATISFACTORIO"]
[null,null,null,null,null,null,null,null,null,null,null,null,null,null,null,"2017-09-22",null,null,null,null,null,null,null,null,null,null,63.999999999999801,"NO SATISFACTORIO"]
[null,null,null,null,null,null,null,null,null,null,null,null,null,null,null,"2017-09-23",null,null,null,null,null,null,null,null,null,null,64.099999999999795,"NO SATISFACTORIO"]
[null,null,null,null,null,null,null,null,null,null,null,null,null,null,null,"2017-09-24",null,null,null,null,null,null,null,null,null,null,64.199999999999804,"NO SATISFACTORIO"]
[null,null,null,null,null,null,null,null,null,null,null,null,null,null,null,"2017-09-25",null,null,null,null,null,null,null,null,null,null,64.299999999999798,"NO SATISFACTORIO"]
[null,null,null,null,null,null,null,null,null,null,null,null,null,null,null,"2017-09-26",null,null,null,null,null,null,null,null,null,null,64.399999999999807,"NO SATISFACTORIO"]
[null,null,null,null,null,null,null,null,null,null,null,null,null,null,null,"2017-09-27",null,null,null,null,null,null,null,null,null,null,64.499999999999801,"NO SATISFACTORIO"]
[null,null,null,null,null,null,null,null,null,null,null,null,null,null,null,"2017-09-28",null,null,null,null,null,null,null,null,null,null,64.599999999999795,"NO SATISFACTORIO"]
[null,null,null,null,null,null,null,null,null,null,null,null,null,null,null,"2017-09-29",null,null,null,null,null,null,null,null,null,null,64.699999999999804,"NO SATISFACTORIO"]
[null,null,null,null,null,null,null,null,null,null,null,null,null,null,null,"2017-09-30",null,null,null,null,null,null,null,null,null,null,64.799999999999798,"NO SATISFACTORIO"]
[null,null,null,null,null,null,null,null,null,null,null,null,null,null,null,"2017-10-01",null,null,null,null,null,null,null,null,null,null,64.899999999999807,"NO SATISFACTORIO"]
[null,null,null,null,null,null,null,null,null,null,null,null,null,null,null,"2017-10-02",null,null,null,null,null,null,null,null,null,null,64.999999999999801,"NO SATISFACTORIO"]
[null,null,null,null,null,null,null,null,null,null,null,null,null,null,null,"2017-10-03",null,null,null,null,null,null,null,null,null,null,65.010000000000005,"SATISFACTORIO"]
[null,null,null,null,null,null,null,null,null,null,null,null,null,null,null,"2017-10-04",null,null,null,null,null,null,null,null,null,null,65.199999999999804,"SATISFACTORIO"]
[null,null,null,null,null,null,null,null,null,null,null,null,null,null,null,"2017-10-05",null,null,null,null,null,null,null,null,null,null,65.299999999999798,"SATISFACTORIO"]
[null,null,null,null,null,null,null,null,null,null,null,null,null,null,null,"2017-10-06",null,null,null,null,null,null,null,null,null,null,65.399999999999807,"SATISFACTORIO"]
[null,null,null,null,null,null,null,null,null,null,null,null,null,null,null,"2017-10-07",null,null,null,null,null,null,null,null,null,null,65.499999999999801,"SATISFACTORIO"]
[null,null,null,null,null,null,null,null,null,null,null,null,null,null,null,"2017-10-08",null,null,null,null,null,null,null,null,null,null,65.599999999999795,"SATISFACTORIO"]
[null,null,null,null,null,null,null,null,null,null,null,null,null,null,null,"2017-10-09",null,null,null,null,null,null,null,null,null,null,65.699999999999804,"SATISFACTORIO"]
[null,null,null,null,null,null,null,null,null,null,null,null,null,null,null,"2017-10-10",null,null,null,null,null,null,null,null,null,null,65.799999999999798,"SATISFACTORIO"]
[null,null,null,null,null,null,null,null,null,null,null,null,null,null,null,"2017-10-11",null,null,null,null,null,null,null,null,null,null,65.899999999999807,"SATISFACTORIO"]
[null,null,null,null,null,null,null,null,null,null,null,null,null,null,null,"2017-10-12",null,null,null,null,null,null,null,null,null,null,65.999999999999801,"SATISFACTORIO"]
[null,null,null,null,null,null,null,null,null,null,null,null,null,null,null,"2017-10-13",null,null,null,null,null,null,null,null,null,null,66.099999999999795,"SATISFACTORIO"]
[null,null,null,null,null,null,null,null,null,null,null,null,null,null,null,"2017-10-14",null,null,null,null,null,null,null,null,null,null,66.199999999999804,"SATISFACTORIO"]
[null,null,null,null,null,null,null,null,null,null,null,null,null,null,null,"2017-10-15",null,null,null,null,null,null,null,null,null,null,66.299999999999798,"SATISFACTORIO"]
[null,null,null,null,null,null,null,null,null,null,null,null,null,null,null,"2017-10-16",null,null,null,null,null,null,null,null,null,null,66.399999999999807,"SATISFACTORIO"]
[null,null,null,null,null,null,null,null,null,null,null,null,null,null,null,"2017-10-17",null,null,null,null,null,null,null,null,null,null,66.499999999999801,"SATISFACTORIO"]
[null,null,null,null,null,null,null,null,null,null,null,null,null,null,null,"2017-10-18",null,null,null,null,null,null,null,null,null,null,66.599999999999795,"SATISFACTORIO"]
[null,null,null,null,null,null,null,null,null,null,null,null,null,null,null,"2017-10-19",null,null,null,null,null,null,null,null,null,null,66.699999999999804,"SATISFACTORIO"]
[null,null,null,null,null,null,null,null,null,null,null,null,null,null,null,"2017-10-20",null,null,null,null,null,null,null,null,null,null,66.799999999999798,"SATISFACTORIO"]
[null,null,null,null,null,null,null,null,null,null,null,null,null,null,null,"2017-10-21",null,null,null,null,null,null,null,null,null,null,66.899999999999807,"SATISFACTORIO"]
[null,null,null,null,null,null,null,null,null,null,null,null,null,null,null,"2017-10-22",null,null,null,null,null,null,null,null,null,null,66.999999999999801,"SATISFACTORIO"]
[null,null,null,null,null,null,null,null,null,null,null,null,null,null,null,"2017-10-23",null,null,null,null,null,null,null,null,null,null,67.099999999999795,"SATISFACTORIO"]
[null,null,null,null,null,null,null,null,null,null,null,null,null,null,null,"2017-10-24",null,null,null,null,null,null,null,null,null,null,67.199999999999804,"SATISFACTORIO"]
[null,null,null,null,null,null,null,null,null,null,null,null,null,null,null,"2017-10-25",null,null,null,null,null,null,null,null,null,null,67.299999999999798,"SATISFACTORIO"]
[null,null,null,null,null,null,null,null,null,null,null,null,null,null,null,"2017-10-26",null,null,null,null,null,null,null,null,null,null,67.399999999999807,"SATISFACTORIO"]
[null,null,null,null,null,null,null,null,null,null,null,null,null,null,null,"2017-10-27",null,null,null,null,null,null,null,null,null,null,67.499999999999801,"SATISFACTORIO"]
[null,null,null,null,null,null,null,null,null,null,null,null,null,null,null,"2017-10-28",null,null,null,null,null,null,null,null,null,null,67.599999999999795,"SATISFACTORIO"]
[null,null,null,null,null,null,null,null,null,null,null,null,null,null,null,"2017-10-29",null,null,null,null,null,null,null,null,null,null,67.699999999999804,"SATISFACTORIO"]
[null,null,null,null,null,null,null,null,null,null,null,null,null,null,null,"2017-10-30",null,null,null,null,null,null,null,null,null,null,67.799999999999798,"SATISFACTORIO"]
[null,null,null,null,null,null,null,null,null,null,null,null,null,null,null,"2017-10-31",null,null,null,null,null,null,null,null,null,null,67.899999999999807,"SATISFACTORIO"]
[null,null,null,null,null,null,null,null,null,null,null,null,null,null,null,"2017-11-01",null,null,null,null,null,null,null,null,null,null,67.999999999999801,"SATISFACTORIO"]
[null,null,null,null,null,null,null,null,null,null,null,null,null,null,null,"2017-11-02",null,null,null,null,null,null,null,null,null,null,68.099999999999795,"SATISFACTORIO"]
[null,null,null,null,null,null,null,null,null,null,null,null,null,null,null,"2017-11-03",null,null,null,null,null,null,null,null,null,null,68.199999999999804,"SATISFACTORIO"]
[null,null,null,null,null,null,null,null,null,null,null,null,null,null,null,"2017-11-04",null,null,null,null,null,null,null,null,null,null,68.299999999999798,"SATISFACTORIO"]
[null,null,null,null,null,null,null,null,null,null,null,null,null,null,null,"2017-11-05",null,null,null,null,null,null,null,null,null,null,68.399999999999807,"SATISFACTORIO"]
[null,null,null,null,null,null,null,null,null,null,null,null,null,null,null,"2017-11-06",null,null,null,null,null,null,null,null,null,null,68.499999999999801,"SATISFACTORIO"]
[null,null,null,null,null,null,null,null,null,null,null,null,null,null,null,"2017-11-07",null,null,null,null,null,null,null,null,null,null,68.599999999999795,"SATISFACTORIO"]
[null,null,null,null,null,null,null,null,null,null,null,null,null,null,null,"2017-11-08",null,null,null,null,null,null,null,null,null,null,68.699999999999804,"SATISFACTORIO"]
[null,null,null,null,null,null,null,null,null,null,null,null,null,null,null,"2017-11-09",null,null,null,null,null,null,null,null,null,null,68.799999999999798,"SATISFACTORIO"]
[null,null,null,null,null,null,null,null,null,null,null,null,null,null,null,"2017-11-10",null,null,null,null,null,null,null,null,null,null,68.899999999999807,"SATISFACTORIO"]
[null,null,null,null,null,null,null,null,null,null,null,null,null,null,null,"2017-11-11",null,null,null,null,null,null,null,null,null,null,68.999999999999801,"SATISFACTORIO"]
[null,null,null,null,null,null,null,null,null,null,null,null,null,null,null,"2017-11-12",null,null,null,null,null,null,null,null,null,null,69.099999999999795,"SATISFACTORIO"]
[null,null,null,null,null,null,null,null,null,null,null,null,null,null,null,"2017-11-13",null,null,null,null,null,null,null,null,null,null,69.199999999999804,"SATISFACTORIO"]
[null,null,null,null,null,null,null,null,null,null,null,null,null,null,null,"2017-11-14",null,null,null,null,null,null,null,null,null,null,69.299999999999798,"SATISFACTORIO"]
[null,null,null,null,null,null,null,null,null,null,null,null,null,null,null,"2017-11-15",null,null,null,null,null,null,null,null,null,null,69.399999999999807,"SATISFACTORIO"]
[null,null,null,null,null,null,null,null,null,null,null,null,null,null,null,"2017-11-16",null,null,null,null,null,null,null,null,null,null,69.499999999999801,"SATISFACTORIO"]
[null,null,null,null,null,null,null,null,null,null,null,null,null,null,null,"2017-11-17",null,null,null,null,null,null,null,null,null,null,69.599999999999795,"SATISFACTORIO"]
[null,null,null,null,null,null,null,null,null,null,null,null,null,null,null,"2017-11-18",null,null,null,null,null,null,null,null,null,null,69.699999999999804,"SATISFACTORIO"]
[null,null,null,null,null,null,null,null,null,null,null,null,null,null,null,"2017-11-19",null,null,null,null,null,null,null,null,null,null,69.799999999999798,"SATISFACTORIO"]
[null,null,null,null,null,null,null,null,null,null,null,null,null,null,null,"2017-11-20",null,null,null,null,null,null,null,null,null,null,69.899999999999807,"SATISFACTORIO"]
[null,null,null,null,null,null,null,null,null,null,null,null,null,null,null,"2017-11-21",null,null,null,null,null,null,null,null,null,null,69.999999999999801,"SATISFACTORIO"]
[null,null,null,null,null,null,null,null,null,null,null,null,null,null,null,"2017-11-22",null,null,null,null,null,null,null,null,null,null,70.099999999999795,"SATISFACTORIO"]
[null,null,null,null,null,null,null,null,null,null,null,null,null,null,null,"2017-11-23",null,null,null,null,null,null,null,null,null,null,70.199999999999804,"SATISFACTORIO"]
[null,null,null,null,null,null,null,null,null,null,null,null,null,null,null,"2017-11-24",null,null,null,null,null,null,null,null,null,null,70.299999999999798,"SATISFACTORIO"]
[null,null,null,null,null,null,null,null,null,null,null,null,null,null,null,"2017-11-25",null,null,null,null,null,null,null,null,null,null,70.399999999999807,"SATISFACTORIO"]
[null,null,null,null,null,null,null,null,null,null,null,null,null,null,null,"2017-11-26",null,null,null,null,null,null,null,null,null,null,70.499999999999801,"SATISFACTORIO"]
[null,null,null,null,null,null,null,null,null,null,null,null,null,null,null,"2017-11-27",null,null,null,null,null,null,null,null,null,null,70.599999999999795,"SATISFACTORIO"]
[null,null,null,null,null,null,null,null,null,null,null,null,null,null,null,"2017-11-28",null,null,null,null,null,null,null,null,null,null,70.699999999999804,"SATISFACTORIO"]
[null,null,null,null,null,null,null,null,null,null,null,null,null,null,null,"2017-11-29",null,null,null,null,null,null,null,null,null,null,70.799999999999798,"SATISFACTORIO"]
[null,null,null,null,null,null,null,null,null,null,null,null,null,null,null,"2017-11-30",null,null,null,null,null,null,null,null,null,null,70.899999999999807,"SATISFACTORIO"]
[null,null,null,null,null,null,null,null,null,null,null,null,null,null,null,"2017-12-01",null,null,null,null,null,null,null,null,null,null,70.999999999999801,"SATISFACTORIO"]
[null,null,null,null,null,null,null,null,null,null,null,null,null,null,null,"2017-12-02",null,null,null,null,null,null,null,null,null,null,71.099999999999795,"SATISFACTORIO"]
[null,null,null,null,null,null,null,null,null,null,null,null,null,null,null,"2017-12-03",null,null,null,null,null,null,null,null,null,null,71.199999999999804,"SATISFACTORIO"]
[null,null,null,null,null,null,null,null,null,null,null,null,null,null,null,"2017-12-04",null,null,null,null,null,null,null,null,null,null,71.299999999999798,"SATISFACTORIO"]
[null,null,null,null,null,null,null,null,null,null,null,null,null,null,null,"2017-12-05",null,null,null,null,null,null,null,null,null,null,71.399999999999807,"SATISFACTORIO"]
[null,null,null,null,null,null,null,null,null,null,null,null,null,null,null,"2017-12-06",null,null,null,null,null,null,null,null,null,null,71.499999999999801,"SATISFACTORIO"]
[null,null,null,null,null,null,null,null,null,null,null,null,null,null,null,"2017-12-07",null,null,null,null,null,null,null,null,null,null,71.599999999999795,"SATISFACTORIO"]
[null,null,null,null,null,null,null,null,null,null,null,null,null,null,null,"2017-12-08",null,null,null,null,null,null,null,null,null,null,71.699999999999804,"SATISFACTORIO"]
[null,null,null,null,null,null,null,null,null,null,null,null,null,null,null,"2017-12-09",null,null,null,null,null,null,null,null,null,null,71.799999999999798,"SATISFACTORIO"]
[null,null,null,null,null,null,null,null,null,null,null,null,null,null,null,"2017-12-10",null,null,null,null,null,null,null,null,null,null,71.899999999999807,"SATISFACTORIO"]
[null,null,null,null,null,null,null,null,null,null,null,null,null,null,null,"2017-12-11",null,null,null,null,null,null,null,null,null,null,71.999999999999801,"SATISFACTORIO"]
[null,null,null,null,null,null,null,null,null,null,null,null,null,null,null,"2017-12-12",null,null,null,null,null,null,null,null,null,null,72.099999999999795,"SATISFACTORIO"]
[null,null,null,null,null,null,null,null,null,null,null,null,null,null,null,"2017-12-13",null,null,null,null,null,null,null,null,null,null,72.199999999999804,"SATISFACTORIO"]
[null,null,null,null,null,null,null,null,null,null,null,null,null,null,null,"2017-12-14",null,null,null,null,null,null,null,null,null,null,72.299999999999798,"SATISFACTORIO"]
[null,null,null,null,null,null,null,null,null,null,null,null,null,null,null,"2017-12-15",null,null,null,null,null,null,null,null,null,null,72.399999999999807,"SATISFACTORIO"]
[null,null,null,null,null,null,null,null,null,null,null,null,null,null,null,"2017-12-16",null,null,null,null,null,null,null,null,null,null,72.499999999999801,"SATISFACTORIO"]
[null,null,null,null,null,null,null,null,null,null,null,null,null,null,null,"2017-12-17",null,null,null,null,null,null,null,null,null,null,72.599999999999795,"SATISFACTORIO"]
[null,null,null,null,null,null,null,null,null,null,null,null,null,null,null,"2017-12-18",null,null,null,null,null,null,null,null,null,null,72.699999999999804,"SATISFACTORIO"]
[null,null,null,null,null,null,null,null,null,null,null,null,null,null,null,"2017-12-19",null,null,null,null,null,null,null,null,null,null,72.799999999999798,"SATISFACTORIO"]
[null,null,null,null,null,null,null,null,null,null,null,null,null,null,null,"2017-12-20",null,null,null,null,null,null,null,null,null,null,72.899999999999807,"SATISFACTORIO"]
[null,null,null,null,null,null,null,null,null,null,null,null,null,null,null,"2017-12-21",null,null,null,null,null,null,null,null,null,null,72.999999999999801,"SATISFACTORIO"]
[null,null,null,null,null,null,null,null,null,null,null,null,null,null,null,"2017-12-22",null,null,null,null,null,null,null,null,null,null,73.099999999999795,"SATISFACTORIO"]
[null,null,null,null,null,null,null,null,null,null,null,null,null,null,null,"2017-12-23",null,null,null,null,null,null,null,null,null,null,73.199999999999804,"SATISFACTORIO"]
[null,null,null,null,null,null,null,null,null,null,null,null,null,null,null,"2017-12-24",null,null,null,null,null,null,null,null,null,null,73.299999999999798,"SATISFACTORIO"]
[null,null,null,null,null,null,null,null,null,null,null,null,null,null,null,"2017-12-25",null,null,null,null,null,null,null,null,null,null,73.399999999999807,"SATISFACTORIO"]
[null,null,null,null,null,null,null,null,null,null,null,null,null,null,null,"2017-12-26",null,null,null,null,null,null,null,null,null,null,73.499999999999801,"SATISFACTORIO"]
[null,null,null,null,null,null,null,null,null,null,null,null,null,null,null,"2017-12-27",null,null,null,null,null,null,null,null,null,null,73.599999999999795,"SATISFACTORIO"]
[null,null,null,null,null,null,null,null,null,null,null,null,null,null,null,"2017-12-28",null,null,null,null,null,null,null,null,null,null,73.699999999999804,"SATISFACTORIO"]
[null,null,null,null,null,null,null,null,null,null,null,null,null,null,null,"2017-12-29",null,null,null,null,null,null,null,null,null,null,73.799999999999798,"SATISFACTORIO"]
[null,null,null,null,null,null,null,null,null,null,null,null,null,null,null,"2017-12-30",null,null,null,null,null,null,null,null,null,null,73.899999999999807,"SATISFACTORIO"]
[null,null,null,null,null,null,null,null,null,null,null,null,null,null,null,"2017-12-31",null,null,null,null,null,null,null,null,null,null,73.999999999999801,"SATISFACTORIO"]
[null,null,null,null,null,null,null,null,null,null,null,null,null,null,null,"2018-01-01",null,null,null,null,null,null,null,null,null,null,74.099999999999795,"SATISFACTORIO"]
[null,null,null,null,null,null,null,null,null,null,null,null,null,null,null,"2018-01-02",null,null,null,null,null,null,null,null,null,null,74.199999999999804,"SATISFACTORIO"]
[null,null,null,null,null,null,null,null,null,null,null,null,null,null,null,"2018-01-03",null,null,null,null,null,null,null,null,null,null,74.299999999999798,"SATISFACTORIO"]
[null,null,null,null,null,null,null,null,null,null,null,null,null,null,null,"2018-01-04",null,null,null,null,null,null,null,null,null,null,74.399999999999807,"SATISFACTORIO"]
[null,null,null,null,null,null,null,null,null,null,null,null,null,null,null,"2018-01-05",null,null,null,null,null,null,null,null,null,null,74.499999999999801,"SATISFACTORIO"]
[null,null,null,null,null,null,null,null,null,null,null,null,null,null,null,"2018-01-06",null,null,null,null,null,null,null,null,null,null,74.599999999999795,"SATISFACTORIO"]
[null,null,null,null,null,null,null,null,null,null,null,null,null,null,null,"2018-01-07",null,null,null,null,null,null,null,null,null,null,74.699999999999804,"SATISFACTORIO"]
[null,null,null,null,null,null,null,null,null,null,null,null,null,null,null,"2018-01-08",null,null,null,null,null,null,null,null,null,null,74.799999999999798,"SATISFACTORIO"]
[null,null,null,null,null,null,null,null,null,null,null,null,null,null,null,"2018-01-09",null,null,null,null,null,null,null,null,null,null,74.899999999999807,"SATISFACTORIO"]
[null,null,null,null,null,null,null,null,null,null,null,null,null,null,null,"2018-01-10",null,null,null,null,null,null,null,null,null,null,74.999999999999801,"SATISFACTORIO"]
[null,null,null,null,null,null,null,null,null,null,null,null,null,null,null,"2018-01-11",null,null,null,null,null,null,null,null,null,null,75.099999999999795,"SATISFACTORIO"]
[null,null,null,null,null,null,null,null,null,null,null,null,null,null,null,"2018-01-12",null,null,null,null,null,null,null,null,null,null,75.199999999999804,"SATISFACTORIO"]
[null,null,null,null,null,null,null,null,null,null,null,null,null,null,null,"2018-01-13",null,null,null,null,null,null,null,null,null,null,75.299999999999798,"SATISFACTORIO"]
[null,null,null,null,null,null,null,null,null,null,null,null,null,null,null,"2018-01-14",null,null,null,null,null,null,null,null,null,null,75.399999999999807,"SATISFACTORIO"]
[null,null,null,null,null,null,null,null,null,null,null,null,null,null,null,"2018-01-15",null,null,null,null,null,null,null,null,null,null,75.499999999999801,"SATISFACTORIO"]
[null,null,null,null,null,null,null,null,null,null,null,null,null,null,null,"2018-01-16",null,null,null,null,null,null,null,null,null,null,75.599999999999795,"SATISFACTORIO"]
[null,null,null,null,null,null,null,null,null,null,null,null,null,null,null,"2018-01-17",null,null,null,null,null,null,null,null,null,null,75.699999999999804,"SATISFACTORIO"]
[null,null,null,null,null,null,null,null,null,null,null,null,null,null,null,"2018-01-18",null,null,null,null,null,null,null,null,null,null,75.799999999999798,"SATISFACTORIO"]
[null,null,null,null,null,null,null,null,null,null,null,null,null,null,null,"2018-01-19",null,null,null,null,null,null,null,null,null,null,75.899999999999807,"SATISFACTORIO"]
[null,null,null,null,null,null,null,null,null,null,null,null,null,null,null,"2018-01-20",null,null,null,null,null,null,null,null,null,null,75.999999999999801,"SATISFACTORIO"]
[null,null,null,null,null,null,null,null,null,null,null,null,null,null,null,"2018-01-21",null,null,null,null,null,null,null,null,null,null,76.099999999999795,"SATISFACTORIO"]
[null,null,null,null,null,null,null,null,null,null,null,null,null,null,null,"2018-01-22",null,null,null,null,null,null,null,null,null,null,76.199999999999804,"SATISFACTORIO"]
[null,null,null,null,null,null,null,null,null,null,null,null,null,null,null,"2018-01-23",null,null,null,null,null,null,null,null,null,null,76.299999999999798,"SATISFACTORIO"]
[null,null,null,null,null,null,null,null,null,null,null,null,null,null,null,"2018-01-24",null,null,null,null,null,null,null,null,null,null,76.399999999999807,"SATISFACTORIO"]
[null,null,null,null,null,null,null,null,null,null,null,null,null,null,null,"2018-01-25",null,null,null,null,null,null,null,null,null,null,76.499999999999801,"SATISFACTORIO"]
[null,null,null,null,null,null,null,null,null,null,null,null,null,null,null,"2018-01-26",null,null,null,null,null,null,null,null,null,null,76.599999999999795,"SATISFACTORIO"]
[null,null,null,null,null,null,null,null,null,null,null,null,null,null,null,"2018-01-27",null,null,null,null,null,null,null,null,null,null,76.699999999999804,"SATISFACTORIO"]
[null,null,null,null,null,null,null,null,null,null,null,null,null,null,null,"2018-01-28",null,null,null,null,null,null,null,null,null,null,76.799999999999798,"SATISFACTORIO"]
[null,null,null,null,null,null,null,null,null,null,null,null,null,null,null,"2018-01-29",null,null,null,null,null,null,null,null,null,null,76.899999999999807,"SATISFACTORIO"]
[null,null,null,null,null,null,null,null,null,null,null,null,null,null,null,"2018-01-30",null,null,null,null,null,null,null,null,null,null,76.999999999999801,"SATISFACTORIO"]
[null,null,null,null,null,null,null,null,null,null,null,null,null,null,null,"2018-01-31",null,null,null,null,null,null,null,null,null,null,77.099999999999795,"SATISFACTORIO"]
[null,null,null,null,null,null,null,null,null,null,null,null,null,null,null,"2018-02-01",null,null,null,null,null,null,null,null,null,null,77.199999999999804,"SATISFACTORIO"]
[null,null,null,null,null,null,null,null,null,null,null,null,null,null,null,"2018-02-02",null,null,null,null,null,null,null,null,null,null,77.299999999999798,"SATISFACTORIO"]
[null,null,null,null,null,null,null,null,null,null,null,null,null,null,null,"2018-02-03",null,null,null,null,null,null,null,null,null,null,77.399999999999807,"SATISFACTORIO"]
[null,null,null,null,null,null,null,null,null,null,null,null,null,null,null,"2018-02-04",null,null,null,null,null,null,null,null,null,null,77.499999999999801,"SATISFACTORIO"]
[null,null,null,null,null,null,null,null,null,null,null,null,null,null,null,"2018-02-05",null,null,null,null,null,null,null,null,null,null,77.599999999999795,"SATISFACTORIO"]
[null,null,null,null,null,null,null,null,null,null,null,null,null,null,null,"2018-02-06",null,null,null,null,null,null,null,null,null,null,77.699999999999804,"SATISFACTORIO"]
[null,null,null,null,null,null,null,null,null,null,null,null,null,null,null,"2018-02-07",null,null,null,null,null,null,null,null,null,null,77.799999999999798,"SATISFACTORIO"]
[null,null,null,null,null,null,null,null,null,null,null,null,null,null,null,"2018-02-08",null,null,null,null,null,null,null,null,null,null,77.899999999999807,"SATISFACTORIO"]
[null,null,null,null,null,null,null,null,null,null,null,null,null,null,null,"2018-02-09",null,null,null,null,null,null,null,null,null,null,77.999999999999801,"SATISFACTORIO"]
[null,null,null,null,null,null,null,null,null,null,null,null,null,null,null,"2018-02-10",null,null,null,null,null,null,null,null,null,null,78.099999999999795,"SATISFACTORIO"]
[null,null,null,null,null,null,null,null,null,null,null,null,null,null,null,"2018-02-11",null,null,null,null,null,null,null,null,null,null,78.199999999999804,"SATISFACTORIO"]
[null,null,null,null,null,null,null,null,null,null,null,null,null,null,null,"2018-02-12",null,null,null,null,null,null,null,null,null,null,78.299999999999798,"SATISFACTORIO"]
[null,null,null,null,null,null,null,null,null,null,null,null,null,null,null,"2018-02-13",null,null,null,null,null,null,null,null,null,null,78.399999999999807,"SATISFACTORIO"]
[null,null,null,null,null,null,null,null,null,null,null,null,null,null,null,"2018-02-14",null,null,null,null,null,null,null,null,null,null,78.499999999999801,"SATISFACTORIO"]
[null,null,null,null,null,null,null,null,null,null,null,null,null,null,null,"2018-02-15",null,null,null,null,null,null,null,null,null,null,78.599999999999795,"SATISFACTORIO"]
[null,null,null,null,null,null,null,null,null,null,null,null,null,null,null,"2018-02-16",null,null,null,null,null,null,null,null,null,null,78.699999999999804,"SATISFACTORIO"]
[null,null,null,null,null,null,null,null,null,null,null,null,null,null,null,"2018-02-17",null,null,null,null,null,null,null,null,null,null,78.799999999999798,"SATISFACTORIO"]
[null,null,null,null,null,null,null,null,null,null,null,null,null,null,null,"2018-02-18",null,null,null,null,null,null,null,null,null,null,78.899999999999693,"SATISFACTORIO"]
[null,null,null,null,null,null,null,null,null,null,null,null,null,null,null,"2018-02-19",null,null,null,null,null,null,null,null,null,null,78.999999999999801,"SATISFACTORIO"]
[null,null,null,null,null,null,null,null,null,null,null,null,null,null,null,"2018-02-20",null,null,null,null,null,null,null,null,null,null,79.099999999999795,"SATISFACTORIO"]
[null,null,null,null,null,null,null,null,null,null,null,null,null,null,null,"2018-02-21",null,null,null,null,null,null,null,null,null,null,79.199999999999804,"SATISFACTORIO"]
[null,null,null,null,null,null,null,null,null,null,null,null,null,null,null,"2018-02-22",null,null,null,null,null,null,null,null,null,null,79.299999999999798,"SATISFACTORIO"]
[null,null,null,null,null,null,null,null,null,null,null,null,null,null,null,"2018-02-23",null,null,null,null,null,null,null,null,null,null,79.399999999999693,"SATISFACTORIO"]
[null,null,null,null,null,null,null,null,null,null,null,null,null,null,null,"2018-02-24",null,null,null,null,null,null,null,null,null,null,79.499999999999801,"SATISFACTORIO"]
[null,null,null,null,null,null,null,null,null,null,null,null,null,null,null,"2018-02-25",null,null,null,null,null,null,null,null,null,null,79.599999999999795,"SATISFACTORIO"]
[null,null,null,null,null,null,null,null,null,null,null,null,null,null,null,"2018-02-26",null,null,null,null,null,null,null,null,null,null,79.699999999999804,"SATISFACTORIO"]
[null,null,null,null,null,null,null,null,null,null,null,null,null,null,null,"2018-02-27",null,null,null,null,null,null,null,null,null,null,79.799999999999798,"SATISFACTORIO"]
[null,null,null,null,null,null,null,null,null,null,null,null,null,null,null,"2018-02-28",null,null,null,null,null,null,null,null,null,null,79.899999999999693,"SATISFACTORIO"]
[null,null,null,null,null,null,null,null,null,null,null,null,null,null,null,"2018-03-01",null,null,null,null,null,null,null,null,null,null,79.999999999999801,"DESTACADO"]
[null,null,null,null,null,null,null,null,null,null,null,null,null,null,null,"2018-03-02",null,null,null,null,null,null,null,null,null,null,80.099999999999795,"DESTACADO"]
[null,null,null,null,null,null,null,null,null,null,null,null,null,null,null,"2018-03-03",null,null,null,null,null,null,null,null,null,null,80.199999999999704,"DESTACADO"]
[null,null,null,null,null,null,null,null,null,null,null,null,null,null,null,"2018-03-04",null,null,null,null,null,null,null,null,null,null,80.299999999999798,"DESTACADO"]
[null,null,null,null,null,null,null,null,null,null,null,null,null,null,null,"2018-03-05",null,null,null,null,null,null,null,null,null,null,80.399999999999693,"DESTACADO"]
[null,null,null,null,null,null,null,null,null,null,null,null,null,null,null,"2018-03-06",null,null,null,null,null,null,null,null,null,null,80.499999999999702,"DESTACADO"]
[null,null,null,null,null,null,null,null,null,null,null,null,null,null,null,"2018-03-07",null,null,null,null,null,null,null,null,null,null,80.599999999999795,"DESTACADO"]
[null,null,null,null,null,null,null,null,null,null,null,null,null,null,null,"2018-03-08",null,null,null,null,null,null,null,null,null,null,80.699999999999704,"DESTACADO"]
[null,null,null,null,null,null,null,null,null,null,null,null,null,null,null,"2018-03-09",null,null,null,null,null,null,null,null,null,null,80.799999999999798,"DESTACADO"]
[null,null,null,null,null,null,null,null,null,null,null,null,null,null,null,"2018-03-10",null,null,null,null,null,null,null,null,null,null,80.899999999999693,"DESTACADO"]
[null,null,null,null,null,null,null,null,null,null,null,null,null,null,null,"2018-03-11",null,null,null,null,null,null,null,null,null,null,80.999999999999702,"DESTACADO"]
[null,null,null,null,null,null,null,null,null,null,null,null,null,null,null,"2018-03-12",null,null,null,null,null,null,null,null,null,null,81.099999999999795,"DESTACADO"]
[null,null,null,null,null,null,null,null,null,null,null,null,null,null,null,"2018-03-13",null,null,null,null,null,null,null,null,null,null,81.199999999999704,"DESTACADO"]
[null,null,null,null,null,null,null,null,null,null,null,null,null,null,null,"2018-03-14",null,null,null,null,null,null,null,null,null,null,81.299999999999798,"DESTACADO"]
[null,null,null,null,null,null,null,null,null,null,null,null,null,null,null,"2018-03-15",null,null,null,null,null,null,null,null,null,null,81.399999999999693,"DESTACADO"]
[null,null,null,null,null,null,null,null,null,null,null,null,null,null,null,"2018-03-16",null,null,null,null,null,null,null,null,null,null,81.499999999999702,"DESTACADO"]
[null,null,null,null,null,null,null,null,null,null,null,null,null,null,null,"2018-03-17",null,null,null,null,null,null,null,null,null,null,81.599999999999795,"DESTACADO"]
[null,null,null,null,null,null,null,null,null,null,null,null,null,null,null,"2018-03-18",null,null,null,null,null,null,null,null,null,null,81.699999999999704,"DESTACADO"]
[null,null,null,null,null,null,null,null,null,null,null,null,null,null,null,"2018-03-19",null,null,null,null,null,null,null,null,null,null,81.799999999999699,"DESTACADO"]
[null,null,null,null,null,null,null,null,null,null,null,null,null,null,null,"2018-03-20",null,null,null,null,null,null,null,null,null,null,81.899999999999693,"DESTACADO"]
[null,null,null,null,null,null,null,null,null,null,null,null,null,null,null,"2018-03-21",null,null,null,null,null,null,null,null,null,null,81.999999999999702,"DESTACADO"]
[null,null,null,null,null,null,null,null,null,null,null,null,null,null,null,"2018-03-22",null,null,null,null,null,null,null,null,null,null,82.099999999999696,"DESTACADO"]
[null,null,null,null,null,null,null,null,null,null,null,null,null,null,null,"2018-03-23",null,null,null,null,null,null,null,null,null,null,82.199999999999704,"DESTACADO"]
[null,null,null,null,null,null,null,null,null,null,null,null,null,null,null,"2018-03-24",null,null,null,null,null,null,null,null,null,null,82.299999999999699,"DESTACADO"]
[null,null,null,null,null,null,null,null,null,null,null,null,null,null,null,"2018-03-25",null,null,null,null,null,null,null,null,null,null,82.399999999999693,"DESTACADO"]
[null,null,null,null,null,null,null,null,null,null,null,null,null,null,null,"2018-03-26",null,null,null,null,null,null,null,null,null,null,82.499999999999702,"DESTACADO"]
[null,null,null,null,null,null,null,null,null,null,null,null,null,null,null,"2018-03-27",null,null,null,null,null,null,null,null,null,null,82.599999999999696,"DESTACADO"]
[null,null,null,null,null,null,null,null,null,null,null,null,null,null,null,"2018-03-28",null,null,null,null,null,null,null,null,null,null,82.699999999999704,"DESTACADO"]
[null,null,null,null,null,null,null,null,null,null,null,null,null,null,null,"2018-03-29",null,null,null,null,null,null,null,null,null,null,82.799999999999699,"DESTACADO"]
[null,null,null,null,null,null,null,null,null,null,null,null,null,null,null,"2018-03-30",null,null,null,null,null,null,null,null,null,null,82.899999999999693,"DESTACADO"]
[null,null,null,null,null,null,null,null,null,null,null,null,null,null,null,"2018-03-31",null,null,null,null,null,null,null,null,null,null,82.999999999999702,"DESTACADO"]
[null,null,null,null,null,null,null,null,null,null,null,null,null,null,null,"2018-04-01",null,null,null,null,null,null,null,null,null,null,83.099999999999696,"DESTACADO"]
[null,null,null,null,null,null,null,null,null,null,null,null,null,null,null,"2018-04-02",null,null,null,null,null,null,null,null,null,null,83.199999999999704,"DESTACADO"]
[null,null,null,null,null,null,null,null,null,null,null,null,null,null,null,"2018-04-03",null,null,null,null,null,null,null,null,null,null,83.299999999999699,"DESTACADO"]
[null,null,null,null,null,null,null,null,null,null,null,null,null,null,null,"2018-04-04",null,null,null,null,null,null,null,null,null,null,83.399999999999693,"DESTACADO"]
[null,null,null,null,null,null,null,null,null,null,null,null,null,null,null,"2018-04-05",null,null,null,null,null,null,null,null,null,null,83.499999999999702,"DESTACADO"]
[null,null,null,null,null,null,null,null,null,null,null,null,null,null,null,"2018-04-06",null,null,null,null,null,null,null,null,null,null,83.599999999999696,"DESTACADO"]
[null,null,null,null,null,null,null,null,null,null,null,null,null,null,null,"2018-04-07",null,null,null,null,null,null,null,null,null,null,83.699999999999704,"DESTACADO"]
[null,null,null,null,null,null,null,null,null,null,null,null,null,null,null,"2018-04-08",null,null,null,null,null,null,null,null,null,null,83.799999999999699,"DESTACADO"]
[null,null,null,null,null,null,null,null,null,null,null,null,null,null,null,"2018-04-09",null,null,null,null,null,null,null,null,null,null,83.899999999999693,"DESTACADO"]
[null,null,null,null,null,null,null,null,null,null,null,null,null,null,null,"2018-04-10",null,null,null,null,null,null,null,null,null,null,83.999999999999702,"DESTACADO"]
[null,null,null,null,null,null,null,null,null,null,null,null,null,null,null,"2018-04-11",null,null,null,null,null,null,null,null,null,null,84.099999999999696,"DESTACADO"]
[null,null,null,null,null,null,null,null,null,null,null,null,null,null,null,"2018-04-12",null,null,null,null,null,null,null,null,null,null,84.199999999999704,"DESTACADO"]
[null,null,null,null,null,null,null,null,null,null,null,null,null,null,null,"2018-04-13",null,null,null,null,null,null,null,null,null,null,84.299999999999699,"DESTACADO"]
[null,null,null,null,null,null,null,null,null,null,null,null,null,null,null,"2018-04-14",null,null,null,null,null,null,null,null,null,null,84.399999999999693,"DESTACADO"]
[null,null,null,null,null,null,null,null,null,null,null,null,null,null,null,"2018-04-15",null,null,null,null,null,null,null,null,null,null,84.499999999999702,"DESTACADO"]
[null,null,null,null,null,null,null,null,null,null,null,null,null,null,null,"2018-04-16",null,null,null,null,null,null,null,null,null,null,84.599999999999696,"DESTACADO"]
[null,null,null,null,null,null,null,null,null,null,null,null,null,null,null,"2018-04-17",null,null,null,null,null,null,null,null,null,null,84.699999999999704,"DESTACADO"]
[null,null,null,null,null,null,null,null,null,null,null,null,null,null,null,"2018-04-18",null,null,null,null,null,null,null,null,null,null,84.799999999999699,"DESTACADO"]
[null,null,null,null,null,null,null,null,null,null,null,null,null,null,null,"2018-04-19",null,null,null,null,null,null,null,null,null,null,84.899999999999693,"DESTACADO"]
[null,null,null,null,null,null,null,null,null,null,null,null,null,null,null,"2018-04-20",null,null,null,null,null,null,null,null,null,null,84.999999999999702,"DESTACADO"]
[null,null,null,null,null,null,null,null,null,null,null,null,null,null,null,"2018-04-21",null,null,null,null,null,null,null,null,null,null,85.099999999999696,"DESTACADO"]
[null,null,null,null,null,null,null,null,null,null,null,null,null,null,null,"2018-04-22",null,null,null,null,null,null,null,null,null,null,85.199999999999704,"DESTACADO"]
[null,null,null,null,null,null,null,null,null,null,null,null,null,null,null,"2018-04-23",null,null,null,null,null,null,null,null,null,null,85.299999999999699,"DESTACADO"]
[null,null,null,null,null,null,null,null,null,null,null,null,null,null,null,"2018-04-24",null,null,null,null,null,null,null,null,null,null,85.399999999999693,"DESTACADO"]
[null,null,null,null,null,null,null,null,null,null,null,null,null,null,null,"2018-04-25",null,null,null,null,null,null,null,null,null,null,85.499999999999702,"DESTACADO"]
[null,null,null,null,null,null,null,null,null,null,null,null,null,null,null,"2018-04-26",null,null,null,null,null,null,null,null,null,null,85.599999999999696,"DESTACADO"]
[null,null,null,null,null,null,null,null,null,null,null,null,null,null,null,"2018-04-27",null,null,null,null,null,null,null,null,null,null,85.699999999999704,"DESTACADO"]
[null,null,null,null,null,null,null,null,null,null,null,null,null,null,null,"2018-04-28",null,null,null,null,null,null,null,null,null,null,85.799999999999699,"DESTACADO"]
[null,null,null,null,null,null,null,null,null,null,null,null,null,null,null,"2018-04-29",null,null,null,null,null,null,null,null,null,null,85.899999999999693,"DESTACADO"]
[null,null,null,null,null,null,null,null,null,null,null,null,null,null,null,"2018-04-30",null,null,null,null,null,null,null,null,null,null,85.999999999999702,"DESTACADO"]
[null,null,null,null,null,null,null,null,null,null,null,null,null,null,null,"2018-05-01",null,null,null,null,null,null,null,null,null,null,86.099999999999696,"DESTACADO"]
[null,null,null,null,null,null,null,null,null,null,null,null,null,null,null,"2018-05-02",null,null,null,null,null,null,null,null,null,null,86.199999999999704,"DESTACADO"]
[null,null,null,null,null,null,null,null,null,null,null,null,null,null,null,"2018-05-03",null,null,null,null,null,null,null,null,null,null,86.299999999999699,"DESTACADO"]
[null,null,null,null,null,null,null,null,null,null,null,null,null,null,null,"2018-05-04",null,null,null,null,null,null,null,null,null,null,86.399999999999693,"DESTACADO"]
[null,null,null,null,null,null,null,null,null,null,null,null,null,null,null,"2018-05-05",null,null,null,null,null,null,null,null,null,null,86.499999999999702,"DESTACADO"]
[null,null,null,null,null,null,null,null,null,null,null,null,null,null,null,"2018-05-06",null,null,null,null,null,null,null,null,null,null,86.599999999999696,"DESTACADO"]
[null,null,null,null,null,null,null,null,null,null,null,null,null,null,null,"2018-05-07",null,null,null,null,null,null,null,null,null,null,86.699999999999704,"DESTACADO"]
[null,null,null,null,null,null,null,null,null,null,null,null,null,null,null,"2018-05-08",null,null,null,null,null,null,null,null,null,null,86.799999999999699,"DESTACADO"]
[null,null,null,null,null,null,null,null,null,null,null,null,null,null,null,"2018-05-09",null,null,null,null,null,null,null,null,null,null,86.899999999999693,"DESTACADO"]
[null,null,null,null,null,null,null,null,null,null,null,null,null,null,null,"2018-05-10",null,null,null,null,null,null,null,null,null,null,86.999999999999702,"DESTACADO"]
[null,null,null,null,null,null,null,null,null,null,null,null,null,null,null,"2018-05-11",null,null,null,null,null,null,null,null,null,null,87.099999999999696,"DESTACADO"]
[null,null,null,null,null,null,null,null,null,null,null,null,null,null,null,"2018-05-12",null,null,null,null,null,null,null,null,null,null,87.199999999999704,"DESTACADO"]
[null,null,null,null,null,null,null,null,null,null,null,null,null,null,null,"2018-05-13",null,null,null,null,null,null,null,null,null,null,87.299999999999699,"DESTACADO"]
[null,null,null,null,null,null,null,null,null,null,null,null,null,null,null,"2018-05-14",null,null,null,null,null,null,null,null,null,null,87.399999999999693,"DESTACADO"]
[null,null,null,null,null,null,null,null,null,null,null,null,null,null,null,"2018-05-15",null,null,null,null,null,null,null,null,null,null,87.499999999999702,"DESTACADO"]
[null,null,null,null,null,null,null,null,null,null,null,null,null,null,null,"2018-05-16",null,null,null,null,null,null,null,null,null,null,87.599999999999696,"DESTACADO"]
[null,null,null,null,null,null,null,null,null,null,null,null,null,null,null,"2018-05-17",null,null,null,null,null,null,null,null,null,null,87.699999999999704,"DESTACADO"]
[null,null,null,null,null,null,null,null,null,null,null,null,null,null,null,"2018-05-18",null,null,null,null,null,null,null,null,null,null,87.799999999999699,"DESTACADO"]
[null,null,null,null,null,null,null,null,null,null,null,null,null,null,null,"2018-05-19",null,null,null,null,null,null,null,null,null,null,87.899999999999693,"DESTACADO"]
[null,null,null,null,null,null,null,null,null,null,null,null,null,null,null,"2018-05-20",null,null,null,null,null,null,null,null,null,null,87.999999999999702,"DESTACADO"]
[null,null,null,null,null,null,null,null,null,null,null,null,null,null,null,"2018-05-21",null,null,null,null,null,null,null,null,null,null,88.099999999999696,"DESTACADO"]
[null,null,null,null,null,null,null,null,null,null,null,null,null,null,null,"2018-05-22",null,null,null,null,null,null,null,null,null,null,88.199999999999704,"DESTACADO"]
[null,null,null,null,null,null,null,null,null,null,null,null,null,null,null,"2018-05-23",null,null,null,null,null,null,null,null,null,null,88.299999999999699,"DESTACADO"]
[null,null,null,null,null,null,null,null,null,null,null,null,null,null,null,"2018-05-24",null,null,null,null,null,null,null,null,null,null,88.399999999999693,"DESTACADO"]
[null,null,null,null,null,null,null,null,null,null,null,null,null,null,null,"2018-05-25",null,null,null,null,null,null,null,null,null,null,88.499999999999702,"DESTACADO"]
[null,null,null,null,null,null,null,null,null,null,null,null,null,null,null,"2018-05-26",null,null,null,null,null,null,null,null,null,null,88.599999999999696,"DESTACADO"]
[null,null,null,null,null,null,null,null,null,null,null,null,null,null,null,"2018-05-27",null,null,null,null,null,null,null,null,null,null,88.699999999999704,"DESTACADO"]
[null,null,null,null,null,null,null,null,null,null,null,null,null,null,null,"2018-05-28",null,null,null,null,null,null,null,null,null,null,88.799999999999699,"DESTACADO"]
[null,null,null,null,null,null,null,null,null,null,null,null,null,null,null,"2018-05-29",null,null,null,null,null,null,null,null,null,null,88.899999999999693,"DESTACADO"]
[null,null,null,null,null,null,null,null,null,null,null,null,null,null,null,"2018-05-30",null,null,null,null,null,null,null,null,null,null,88.999999999999702,"DESTACADO"]
[null,null,null,null,null,null,null,null,null,null,null,null,null,null,null,"2018-05-31",null,null,null,null,null,null,null,null,null,null,89.099999999999696,"DESTACADO"]
[null,null,null,null,null,null,null,null,null,null,null,null,null,null,null,"2018-06-01",null,null,null,null,null,null,null,null,null,null,89.199999999999704,"DESTACADO"]
[null,null,null,null,null,null,null,null,null,null,null,null,null,null,null,"2018-06-02",null,null,null,null,null,null,null,null,null,null,89.299999999999699,"DESTACADO"]
[null,null,null,null,null,null,null,null,null,null,null,null,null,null,null,"2018-06-03",null,null,null,null,null,null,null,null,null,null,89.399999999999693,"DESTACADO"]
[null,null,null,null,null,null,null,null,null,null,null,null,null,null,null,"2018-06-04",null,null,null,null,null,null,null,null,null,null,89.499999999999702,"DESTACADO"]
[null,null,null,null,null,null,null,null,null,null,null,null,null,null,null,"2018-06-05",null,null,null,null,null,null,null,null,null,null,89.599999999999696,"DESTACADO"]
[null,null,null,null,null,null,null,null,null,null,null,null,null,null,null,"2018-06-06",null,null,null,null,null,null,null,null,null,null,89.699999999999704,"DESTACADO"]
[null,null,null,null,null,null,null,null,null,null,null,null,null,null,null,"2018-06-07",null,null,null,null,null,null,null,null,null,null,89.799999999999699,"DESTACADO"]
[null,null,null,null,null,null,null,null,null,null,null,null,null,null,null,"2018-06-08",null,null,null,null,null,null,null,null,null,null,89.899999999999693,"DESTACADO"]
[null,null,null,null,null,null,null,null,null,null,null,null,null,null,null,"2018-06-09",null,null,null,null,null,null,null,null,null,null,89.999999999999702,"DESTACADO"]
[null,null,null,null,null,null,null,null,null,null,null,null,null,null,null,"2018-06-10",null,null,null,null,null,null,null,null,null,null,90.099999999999696,"DESTACADO"]
[null,null,null,null,null,null,null,null,null,null,null,null,null,null,null,"2018-06-11",null,null,null,null,null,null,null,null,null,null,90.199999999999704,"DESTACADO"]
[null,null,null,null,null,null,null,null,null,null,null,null,null,null,null,"2018-06-12",null,null,null,null,null,null,null,null,null,null,90.299999999999699,"DESTACADO"]
[null,null,null,null,null,null,null,null,null,null,null,null,null,null,null,"2018-06-13",null,null,null,null,null,null,null,null,null,null,90.399999999999693,"DESTACADO"]
[null,null,null,null,null,null,null,null,null,null,null,null,null,null,null,"2018-06-14",null,null,null,null,null,null,null,null,null,null,90.499999999999702,"DESTACADO"]
[null,null,null,null,null,null,null,null,null,null,null,null,null,null,null,"2018-06-15",null,null,null,null,null,null,null,null,null,null,90.599999999999696,"DESTACADO"]
[null,null,null,null,null,null,null,null,null,null,null,null,null,null,null,"2018-06-16",null,null,null,null,null,null,null,null,null,null,90.699999999999704,"DESTACADO"]
[null,null,null,null,null,null,null,null,null,null,null,null,null,null,null,"2018-06-17",null,null,null,null,null,null,null,null,null,null,90.799999999999699,"DESTACADO"]
[null,null,null,null,null,null,null,null,null,null,null,null,null,null,null,"2018-06-18",null,null,null,null,null,null,null,null,null,null,90.899999999999693,"DESTACADO"]
[null,null,null,null,null,null,null,null,null,null,null,null,null,null,null,"2018-06-19",null,null,null,null,null,null,null,null,null,null,90.999999999999702,"DESTACADO"]
[null,null,null,null,null,null,null,null,null,null,null,null,null,null,null,"2018-06-20",null,null,null,null,null,null,null,null,null,null,91.099999999999696,"DESTACADO"]
[null,null,null,null,null,null,null,null,null,null,null,null,null,null,null,"2018-06-21",null,null,null,null,null,null,null,null,null,null,91.199999999999704,"DESTACADO"]
[null,null,null,null,null,null,null,null,null,null,null,null,null,null,null,"2018-06-22",null,null,null,null,null,null,null,null,null,null,91.299999999999699,"DESTACADO"]
[null,null,null,null,null,null,null,null,null,null,null,null,null,null,null,"2018-06-23",null,null,null,null,null,null,null,null,null,null,91.399999999999693,"DESTACADO"]
[null,null,null,null,null,null,null,null,null,null,null,null,null,null,null,"2018-06-24",null,null,null,null,null,null,null,null,null,null,91.499999999999702,"DESTACADO"]
[null,null,null,null,null,null,null,null,null,null,null,null,null,null,null,"2018-06-25",null,null,null,null,null,null,null,null,null,null,91.599999999999696,"DESTACADO"]
[null,null,null,null,null,null,null,null,null,null,null,null,null,null,null,"2018-06-26",null,null,null,null,null,null,null,null,null,null,91.699999999999704,"DESTACADO"]
[null,null,null,null,null,null,null,null,null,null,null,null,null,null,null,"2018-06-27",null,null,null,null,null,null,null,null,null,null,91.799999999999699,"DESTACADO"]
[null,null,null,null,null,null,null,null,null,null,null,null,null,null,null,"2018-06-28",null,null,null,null,null,null,null,null,null,null,91.899999999999693,"DESTACADO"]
[null,null,null,null,null,null,null,null,null,null,null,null,null,null,null,"2018-06-29",null,null,null,null,null,null,null,null,null,null,91.999999999999702,"DESTACADO"]
[null,null,null,null,null,null,null,null,null,null,null,null,null,null,null,"2018-06-30",null,null,null,null,null,null,null,null,null,null,92.099999999999696,"DESTACADO"]
[null,null,null,null,null,null,null,null,null,null,null,null,null,null,null,"2018-07-01",null,null,null,null,null,null,null,null,null,null,92.199999999999704,"DESTACADO"]
[null,null,null,null,null,null,null,null,null,null,null,null,null,null,null,"2018-07-02",null,null,null,null,null,null,null,null,null,null,92.299999999999699,"DESTACADO"]
[null,null,null,null,null,null,null,null,null,null,null,null,null,null,null,"2018-07-03",null,null,null,null,null,null,null,null,null,null,92.399999999999693,"DESTACADO"]
[null,null,null,null,null,null,null,null,null,null,null,null,null,null,null,"2018-07-04",null,null,null,null,null,null,null,null,null,null,92.499999999999702,"DESTACADO"]
[null,null,null,null,null,null,null,null,null,null,null,null,null,null,null,"2018-07-05",null,null,null,null,null,null,null,null,null,null,92.599999999999696,"DESTACADO"]
[null,null,null,null,null,null,null,null,null,null,null,null,null,null,null,"2018-07-06",null,null,null,null,null,null,null,null,null,null,92.699999999999704,"DESTACADO"]
[null,null,null,null,null,null,null,null,null,null,null,null,null,null,null,"2018-07-07",null,null,null,null,null,null,null,null,null,null,92.799999999999699,"DESTACADO"]
[null,null,null,null,null,null,null,null,null,null,null,null,null,null,null,"2018-07-08",null,null,null,null,null,null,null,null,null,null,92.899999999999693,"DESTACADO"]
[null,null,null,null,null,null,null,null,null,null,null,null,null,null,null,"2018-07-09",null,null,null,null,null,null,null,null,null,null,92.999999999999702,"DESTACADO"]
[null,null,null,null,null,null,null,null,null,null,null,null,null,null,null,"2018-07-10",null,null,null,null,null,null,null,null,null,null,93.099999999999696,"DESTACADO"]
[null,null,null,null,null,null,null,null,null,null,null,null,null,null,null,"2018-07-11",null,null,null,null,null,null,null,null,null,null,93.199999999999704,"DESTACADO"]
[null,null,null,null,null,null,null,null,null,null,null,null,null,null,null,"2018-07-12",null,null,null,null,null,null,null,null,null,null,93.299999999999699,"DESTACADO"]
[null,null,null,null,null,null,null,null,null,null,null,null,null,null,null,"2018-07-13",null,null,null,null,null,null,null,null,null,null,93.399999999999693,"DESTACADO"]
[null,null,null,null,null,null,null,null,null,null,null,null,null,null,null,"2018-07-14",null,null,null,null,null,null,null,null,null,null,93.499999999999702,"DESTACADO"]
[null,null,null,null,null,null,null,null,null,null,null,null,null,null,null,"2018-07-15",null,null,null,null,null,null,null,null,null,null,93.599999999999696,"DESTACADO"]
[null,null,null,null,null,null,null,null,null,null,null,null,null,null,null,"2018-07-16",null,null,null,null,null,null,null,null,null,null,93.699999999999704,"DESTACADO"]
[null,null,null,null,null,null,null,null,null,null,null,null,null,null,null,"2018-07-17",null,null,null,null,null,null,null,null,null,null,93.799999999999699,"DESTACADO"]
[null,null,null,null,null,null,null,null,null,null,null,null,null,null,null,"2018-07-18",null,null,null,null,null,null,null,null,null,null,93.899999999999693,"DESTACADO"]
[null,null,null,null,null,null,null,null,null,null,null,null,null,null,null,"2018-07-19",null,null,null,null,null,null,null,null,null,null,93.999999999999702,"DESTACADO"]
[null,null,null,null,null,null,null,null,null,null,null,null,null,null,null,"2018-07-20",null,null,null,null,null,null,null,null,null,null,94.099999999999696,"DESTACADO"]
[null,null,null,null,null,null,null,null,null,null,null,null,null,null,null,"2018-07-21",null,null,null,null,null,null,null,null,null,null,94.199999999999704,"DESTACADO"]
[null,null,null,null,null,null,null,null,null,null,null,null,null,null,null,"2018-07-22",null,null,null,null,null,null,null,null,null,null,94.299999999999699,"DESTACADO"]
[null,null,null,null,null,null,null,null,null,null,null,null,null,null,null,"2018-07-23",null,null,null,null,null,null,null,null,null,null,94.399999999999693,"DESTACADO"]
[null,null,null,null,null,null,null,null,null,null,null,null,null,null,null,"2018-07-24",null,null,null,null,null,null,null,null,null,null,94.499999999999702,"DESTACADO"]
[null,null,null,null,null,null,null,null,null,null,null,null,null,null,null,"2018-07-25",null,null,null,null,null,null,null,null,null,null,94.599999999999696,"DESTACADO"]
[null,null,null,null,null,null,null,null,null,null,null,null,null,null,null,"2018-07-26",null,null,null,null,null,null,null,null,null,null,94.699999999999704,"DESTACADO"]
[null,null,null,null,null,null,null,null,null,null,null,null,null,null,null,"2018-07-27",null,null,null,null,null,null,null,null,null,null,94.799999999999699,"DESTACADO"]
[null,null,null,null,null,null,null,null,null,null,null,null,null,null,null,"2018-07-28",null,null,null,null,null,null,null,null,null,null,94.899999999999693,"DESTACADO"]
[null,null,null,null,null,null,null,null,null,null,null,null,null,null,null,"2018-07-29",null,null,null,null,null,null,null,null,null,null,94.999999999999702,"SOBRESALIENTE"]
[null,null,null,null,null,null,null,null,null,null,null,null,null,null,null,"2018-07-30",null,null,null,null,null,null,null,null,null,null,95.099999999999696,"SOBRESALIENTE"]
[null,null,null,null,null,null,null,null,null,null,null,null,null,null,null,"2018-07-31",null,null,null,null,null,null,null,null,null,null,95.199999999999704,"SOBRESALIENTE"]
[null,null,null,null,null,null,null,null,null,null,null,null,null,null,null,"2018-08-01",null,null,null,null,null,null,null,null,null,null,95.299999999999699,"SOBRESALIENTE"]
[null,null,null,null,null,null,null,null,null,null,null,null,null,null,null,"2018-08-02",null,null,null,null,null,null,null,null,null,null,95.399999999999693,"SOBRESALIENTE"]
[null,null,null,null,null,null,null,null,null,null,null,null,null,null,null,"2018-08-03",null,null,null,null,null,null,null,null,null,null,95.499999999999702,"SOBRESALIENTE"]
[null,null,null,null,null,null,null,null,null,null,null,null,null,null,null,"2018-08-04",null,null,null,null,null,null,null,null,null,null,95.599999999999696,"SOBRESALIENTE"]
[null,null,null,null,null,null,null,null,null,null,null,null,null,null,null,"2018-08-05",null,null,null,null,null,null,null,null,null,null,95.699999999999704,"SOBRESALIENTE"]
[null,null,null,null,null,null,null,null,null,null,null,null,null,null,null,"2018-08-06",null,null,null,null,null,null,null,null,null,null,95.799999999999699,"SOBRESALIENTE"]
[null,null,null,null,null,null,null,null,null,null,null,null,null,null,null,"2018-08-07",null,null,null,null,null,null,null,null,null,null,95.899999999999693,"SOBRESALIENTE"]
[null,null,null,null,null,null,null,null,null,null,null,null,null,null,null,"2018-08-08",null,null,null,null,null,null,null,null,null,null,95.999999999999702,"SOBRESALIENTE"]
[null,null,null,null,null,null,null,null,null,null,null,null,null,null,null,"2018-08-09",null,null,null,null,null,null,null,null,null,null,96.099999999999696,"SOBRESALIENTE"]
[null,null,null,null,null,null,null,null,null,null,null,null,null,null,null,"2018-08-10",null,null,null,null,null,null,null,null,null,null,96.199999999999704,"SOBRESALIENTE"]
[null,null,null,null,null,null,null,null,null,null,null,null,null,null,null,"2018-08-11",null,null,null,null,null,null,null,null,null,null,96.299999999999699,"SOBRESALIENTE"]
[null,null,null,null,null,null,null,null,null,null,null,null,null,null,null,"2018-08-12",null,null,null,null,null,null,null,null,null,null,96.399999999999693,"SOBRESALIENTE"]
[null,null,null,null,null,null,null,null,null,null,null,null,null,null,null,"2018-08-13",null,null,null,null,null,null,null,null,null,null,96.499999999999702,"SOBRESALIENTE"]
[null,null,null,null,null,null,null,null,null,null,null,null,null,null,null,"2018-08-14",null,null,null,null,null,null,null,null,null,null,96.599999999999696,"SOBRESALIENTE"]
[null,null,null,null,null,null,null,null,null,null,null,null,null,null,null,"2018-08-15",null,null,null,null,null,null,null,null,null,null,96.699999999999704,"SOBRESALIENTE"]
[null,null,null,null,null,null,null,null,null,null,null,null,null,null,null,"2018-08-16",null,null,null,null,null,null,null,null,null,null,96.799999999999699,"SOBRESALIENTE"]
[null,null,null,null,null,null,null,null,null,null,null,null,null,null,null,"2018-08-17",null,null,null,null,null,null,null,null,null,null,96.899999999999693,"SOBRESALIENTE"]
[null,null,null,null,null,null,null,null,null,null,null,null,null,null,null,"2018-08-18",null,null,null,null,null,null,null,null,null,null,96.999999999999702,"SOBRESALIENTE"]
[null,null,null,null,null,null,null,null,null,null,null,null,null,null,null,"2018-08-19",null,null,null,null,null,null,null,null,null,null,97.099999999999696,"SOBRESALIENTE"]
[null,null,null,null,null,null,null,null,null,null,null,null,null,null,null,"2018-08-20",null,null,null,null,null,null,null,null,null,null,97.199999999999704,"SOBRESALIENTE"]
[null,null,null,null,null,null,null,null,null,null,null,null,null,null,null,"2018-08-21",null,null,null,null,null,null,null,null,null,null,97.299999999999699,"SOBRESALIENTE"]
[null,null,null,null,null,null,null,null,null,null,null,null,null,null,null,"2018-08-22",null,null,null,null,null,null,null,null,null,null,97.399999999999693,"SOBRESALIENTE"]
[null,null,null,null,null,null,null,null,null,null,null,null,null,null,null,"2018-08-23",null,null,null,null,null,null,null,null,null,null,97.499999999999702,"SOBRESALIENTE"]
[null,null,null,null,null,null,null,null,null,null,null,null,null,null,null,"2018-08-24",null,null,null,null,null,null,null,null,null,null,97.599999999999696,"SOBRESALIENTE"]
[null,null,null,null,null,null,null,null,null,null,null,null,null,null,null,"2018-08-25",null,null,null,null,null,null,null,null,null,null,97.699999999999704,"SOBRESALIENTE"]
[null,null,null,null,null,null,null,null,null,null,null,null,null,null,null,"2018-08-26",null,null,null,null,null,null,null,null,null,null,97.799999999999699,"SOBRESALIENTE"]
[null,null,null,null,null,null,null,null,null,null,null,null,null,null,null,"2018-08-27",null,null,null,null,null,null,null,null,null,null,97.899999999999693,"SOBRESALIENTE"]
[null,null,null,null,null,null,null,null,null,null,null,null,null,null,null,"2018-08-28",null,null,null,null,null,null,null,null,null,null,97.999999999999702,"SOBRESALIENTE"]
[null,null,null,null,null,null,null,null,null,null,null,null,null,null,null,"2018-08-29",null,null,null,null,null,null,null,null,null,null,98.099999999999696,"SOBRESALIENTE"]
[null,null,null,null,null,null,null,null,null,null,null,null,null,null,null,"2018-08-30",null,null,null,null,null,null,null,null,null,null,98.199999999999704,"SOBRESALIENTE"]
[null,null,null,null,null,null,null,null,null,null,null,null,null,null,null,"2018-08-31",null,null,null,null,null,null,null,null,null,null,98.299999999999699,"SOBRESALIENTE"]
[null,null,null,null,null,null,null,null,null,null,null,null,null,null,null,"2018-09-01",null,null,null,null,null,null,null,null,null,null,98.399999999999693,"SOBRESALIENTE"]
[null,null,null,null,null,null,null,null,null,null,null,null,null,null,null,"2018-09-02",null,null,null,null,null,null,null,null,null,null,98.499999999999702,"SOBRESALIENTE"]
[null,null,null,null,null,null,null,null,null,null,null,null,null,null,null,"2018-09-03",null,null,null,null,null,null,null,null,null,null,98.599999999999696,"SOBRESALIENTE"]
[null,null,null,null,null,null,null,null,null,null,null,null,null,null,null,"2018-09-04",null,null,null,null,null,null,null,null,null,null,98.699999999999704,"SOBRESALIENTE"]
[null,null,null,null,null,null,null,null,null,null,null,null,null,null,null,"2018-09-05",null,null,null,null,null,null,null,null,null,null,98.799999999999699,"SOBRESALIENTE"]
[null,null,null,null,null,null,null,null,null,null,null,null,null,null,null,"2018-09-06",null,null,null,null,null,null,null,null,null,null,98.899999999999693,"SOBRESALIENTE"]
[null,null,null,null,null,null,null,null,null,null,null,null,null,null,null,"2018-09-07",null,null,null,null,null,null,null,null,null,null,98.999999999999702,"SOBRESALIENTE"]
[null,null,null,null,null,null,null,null,null,null,null,null,null,null,null,"2018-09-08",null,null,null,null,null,null,null,null,null,null,99.099999999999696,"SOBRESALIENTE"]
[null,null,null,null,null,null,null,null,null,null,null,null,null,null,null,"2018-09-09",null,null,null,null,null,null,null,null,null,null,99.199999999999704,"SOBRESALIENTE"]
[null,null,null,null,null,null,null,null,null,null,null,null,null,null,null,"2018-09-10",null,null,null,null,null,null,null,null,null,null,99.299999999999699,"SOBRESALIENTE"]
[null,null,null,null,null,null,null,null,null,null,null,null,null,null,null,"2018-09-11",null,null,null,null,null,null,null,null,null,null,99.399999999999693,"SOBRESALIENTE"]
[null,null,null,null,null,null,null,null,null,null,null,null,null,null,null,"2018-09-12",null,null,null,null,null,null,null,null,null,null,99.499999999999702,"SOBRESALIENTE"]
[null,null,null,null,null,null,null,null,null,null,null,null,null,null,null,"2018-09-13",null,null,null,null,null,null,null,null,null,null,99.599999999999696,"SOBRESALIENTE"]
[null,null,null,null,null,null,null,null,null,null,null,null,null,null,null,"2018-09-14",null,null,null,null,null,null,null,null,null,null,99.699999999999704,"SOBRESALIENTE"]
[null,null,null,null,null,null,null,null,null,null,null,null,null,null,null,"2018-09-15",null,null,null,null,null,null,null,null,null,null,99.799999999999699,"SOBRESALIENTE"]
[null,null,null,null,null,null,null,null,null,null,null,null,null,null,null,"2018-09-16",null,null,null,null,null,null,null,null,null,null,99.899999999999693,"SOBRESALIENTE"]
[null,null,null,null,null,null,null,null,null,null,null,null,null,null,null,"2018-09-17",null,null,null,null,null,null,null,null,null,null,99.999999999999702,"SOBRESALIENTE"]
[null,null,null,null,null,null,null,null,null,null,null,null,null,null,null,"2018-09-18"]
[null,null,null,null,null,null,null,null,null,null,null,null,null,null,null,"2018-09-19"]
[null,null,null,null,null,null,null,null,null,null,null,null,null,null,null,"2018-09-20"]
[null,null,null,null,null,null,null,null,null,null,null,null,null,null,null,"2018-09-21"]
[null,null,null,null,null,null,null,null,null,null,null,null,null,null,null,"2018-09-22"]
[null,null,null,null,null,null,null,null,null,null,null,null,null,null,null,"2018-09-23"]
[null,null,null,null,null,null,null,null,null,null,null,null,null,null,null,"2018-09-24"]
[null,null,null,null,null,null,null,null,null,null,null,null,null,null,null,"2018-09-25"]
[null,null,null,null,null,null,null,null,null,null,null,null,null,null,null,"2018-09-26"]
[null,null,null,null,null,null,null,null,null,null,null,null,null,null,null,"2018-09-27"]
[null,null,null,null,null,null,null,null,null,null,null,null,null,null,null,"2018-09-28"]
[null,null,null,null,null,null,null,null,null,null,null,null,null,null,null,"2018-09-29"]
[null,null,null,null,null,null,null,null,null,null,null,null,null,null,null,"2018-09-30"]
[null,null,null,null,null,null,null,null,null,null,null,null,null,null,null,"2018-10-01"]
[null,null,null,null,null,null,null,null,null,null,null,null,null,null,null,"2018-10-02"]
[null,null,null,null,null,null,null,null,null,null,null,null,null,null,null,"2018-10-03"]
[null,null,null,null,null,null,null,null,null,null,null,null,null,null,null,"2018-10-04"]
[null,null,null,null,null,null,null,null,null,null,null,null,null,null,null,"2018-10-05"]
[null,null,null,null,null,null,null,null,null,null,null,null,null,null,null,"2018-10-06"]
[null,null,null,null,null,null,null,null,null,null,null,null,null,null,null,"2018-10-07"]
[null,null,null,null,null,null,null,null,null,null,null,null,null,null,null,"2018-10-08"]
[null,null,null,null,null,null,null,null,null,null,null,null,null,null,null,"2018-10-09"]
[null,null,null,null,null,null,null,null,null,null,null,null,null,null,null,"2018-10-10"]
[null,null,null,null,null,null,null,null,null,null,null,null,null,null,null,"2018-10-11"]
[null,null,null,null,null,null,null,null,null,null,null,null,null,null,null,"2018-10-12"]
[null,null,null,null,null,null,null,null,null,null,null,null,null,null,null,"2018-10-13"]
[null,null,null,null,null,null,null,null,null,null,null,null,null,null,null,"2018-10-14"]
[null,null,null,null,null,null,null,null,null,null,null,null,null,null,null,"2018-10-15"]
[null,null,null,null,null,null,null,null,null,null,null,null,null,null,null,"2018-10-16"]
[null,null,null,null,null,null,null,null,null,null,null,null,null,null,null,"2018-10-17"]
[null,null,null,null,null,null,null,null,null,null,null,null,null,null,null,"2018-10-18"]
[null,null,null,null,null,null,null,null,null,null,null,null,null,null,null,"2018-10-19"]
[null,null,null,null,null,null,null,null,null,null,null,null,null,null,null,"2018-10-20"]
[null,null,null,null,null,null,null,null,null,null,null,null,null,null,null,"2018-10-21"]
[null,null,null,null,null,null,null,null,null,null,null,null,null,null,null,"2018-10-22"]
[null,null,null,null,null,null,null,null,null,null,null,null,null,null,null,"2018-10-23"]
[null,null,null,null,null,null,null,null,null,null,null,null,null,null,null,"2018-10-24"]
[null,null,null,null,null,null,null,null,null,null,null,null,null,null,null,"2018-10-25"]
[null,null,null,null,null,null,null,null,null,null,null,null,null,null,null,"2018-10-26"]
[null,null,null,null,null,null,null,null,null,null,null,null,null,null,null,"2018-10-27"]
[null,null,null,null,null,null,null,null,null,null,null,null,null,null,null,"2018-10-28"]
[null,null,null,null,null,null,null,null,null,null,null,null,null,null,null,"2018-10-29"]
[null,null,null,null,null,null,null,null,null,null,null,null,null,null,null,"2018-10-30"]
[null,null,null,null,null,null,null,null,null,null,null,null,null,null,null,"2018-10-31"]
[null,null,null,null,null,null,null,null,null,null,null,null,null,null,null,"2018-11-01"]
[null,null,null,null,null,null,null,null,null,null,null,null,null,null,null,"2018-11-02"]
[null,null,null,null,null,null,null,null,null,null,null,null,null,null,null,"2018-11-03"]
[null,null,null,null,null,null,null,null,null,null,null,null,null,null,null,"2018-11-04"]
[null,null,null,null,null,null,null,null,null,null,null,null,null,null,null,"2018-11-05"]
[null,null,null,null,null,null,null,null,null,null,null,null,null,null,null,"2018-11-06"]
[null,null,null,null,null,null,null,null,null,null,null,null,null,null,null,"2018-11-07"]
[null,null,null,null,null,null,null,null,null,null,null,null,null,null,null,"2018-11-08"]
[null,null,null,null,null,null,null,null,null,null,null,null,null,null,null,"2018-11-09"]
[null,null,null,null,null,null,null,null,null,null,null,null,null,null,null,"2018-11-10"]
[null,null,null,null,null,null,null,null,null,null,null,null,null,null,null,"2018-11-11"]
[null,null,null,null,null,null,null,null,null,null,null,null,null,null,null,"2018-11-12"]
[null,null,null,null,null,null,null,null,null,null,null,null,null,null,null,"2018-11-13"]
[null,null,null,null,null,null,null,null,null,null,null,null,null,null,null,"2018-11-14"]
[null,null,null,null,null,null,null,null,null,null,null,null,null,null,null,"2018-11-15"]
[null,null,null,null,null,null,null,null,null,null,null,null,null,null,null,"2018-11-16"]
[null,null,null,null,null,null,null,null,null,null,null,null,null,null,null,"2018-11-17"]
[null,null,null,null,null,null,null,null,null,null,null,null,null,null,null,"2018-11-18"]
[null,null,null,null,null,null,null,null,null,null,null,null,null,null,null,"2018-11-19"]
[null,null,null,null,null,null,null,null,null,null,null,null,null,null,null,"2018-11-20"]
[null,null,null,null,null,null,null,null,null,null,null,null,null,null,null,"2018-11-21"]
[null,null,null,null,null,null,null,null,null,null,null,null,null,null,null,"2018-11-22"]
[null,null,null,null,null,null,null,null,null,null,null,null,null,null,null,"2018-11-23"]
[null,null,null,null,null,null,null,null,null,null,null,null,null,null,null,"2018-11-24"]
[null,null,null,null,null,null,null,null,null,null,null,null,null,null,null,"2018-11-25"]
[null,null,null,null,null,null,null,null,null,null,null,null,null,null,null,"2018-11-26"]
[null,null,null,null,null,null,null,null,null,null,null,null,null,null,null,"2018-11-27"]
[null,null,null,null,null,null,null,null,null,null,null,null,null,null,null,"2018-11-28"]
[null,null,null,null,null,null,null,null,null,null,null,null,null,null,null,"2018-11-29"]
[null,null,null,null,null,null,null,null,null,null,null,null,null,null,null,"2018-11-30"]
[null,null,null,null,null,null,null,null,null,null,null,null,null,null,null,"2018-12-01"]
[null,null,null,null,null,null,null,null,null,null,null,null,null,null,null,"2018-12-02"]
[null,null,null,null,null,null,null,null,null,null,null,null,null,null,null,"2018-12-03"]
[null,null,null,null,null,null,null,null,null,null,null,null,null,null,null,"2018-12-04"]
[null,null,null,null,null,null,null,null,null,null,null,null,null,null,null,"2018-12-05"]
[null,null,null,null,null,null,null,null,null,null,null,null,null,null,null,"2018-12-06"]
[null,null,null,null,null,null,null,null,null,null,null,null,null,null,null,"2018-12-07"]
[null,null,null,null,null,null,null,null,null,null,null,null,null,null,null,"2018-12-08"]
[null,null,null,null,null,null,null,null,null,null,null,null,null,null,null,"2018-12-09"]
[null,null,null,null,null,null,null,null,null,null,null,null,null,null,null,"2018-12-10"]
[null,null,null,null,null,null,null,null,null,null,null,null,null,null,null,"2018-12-11"]
[null,null,null,null,null,null,null,null,null,null,null,null,null,null,null,"2018-12-12"]
[null,null,null,null,null,null,null,null,null,null,null,null,null,null,null,"2018-12-13"]
[null,null,null,null,null,null,null,null,null,null,null,null,null,null,null,"2018-12-14"]
[null,null,null,null,null,null,null,null,null,null,null,null,null,null,null,"2018-12-15"]
[null,null,null,null,null,null,null,null,null,null,null,null,null,null,null,"2018-12-16"]
[null,null,null,null,null,null,null,null,null,null,null,null,null,null,null,"2018-12-17"]
[null,null,null,null,null,null,null,null,null,null,null,null,null,null,null,"2018-12-18"]
[null,null,null,null,null,null,null,null,null,null,null,null,null,null,null,"2018-12-19"]
[null,null,null,null,null,null,null,null,null,null,null,null,null,null,null,"2018-12-20"]
[null,null,null,null,null,null,null,null,null,null,null,null,null,null,null,"2018-12-21"]
[null,null,null,null,null,null,null,null,null,null,null,null,null,null,null,"2018-12-22"]
[null,null,null,null,null,null,null,null,null,null,null,null,null,null,null,"2018-12-23"]
[null,null,null,null,null,null,null,null,null,null,null,null,null,null,null,"2018-12-24"]
[null,null,null,null,null,null,null,null,null,null,null,null,null,null,null,"2018-12-25"]
[null,null,null,null,null,null,null,null,null,null,null,null,null,null,null,"2018-12-26"]
[null,null,null,null,null,null,null,null,null,null,null,null,null,null,null,"2018-12-27"]
[null,null,null,null,null,null,null,null,null,null,null,null,null,null,null,"2018-12-28"]
[null,null,null,null,null,null,null,null,null,null,null,null,null,null,null,"2018-12-29"]
[null,null,null,null,null,null,null,null,null,null,null,null,null,null,null,"2018-12-30"]
[null,null,null,null,null,null,null,null,null,null,null,null,null,null,null,"2018-12-31"]
[null,null,null,null,null,null,null,null,null,null,null,null,null,null,null,"2019-01-01"]
[null,null,null,null,null,null,null,null,null,null,null,null,null,null,null,"2019-01-02"]
[null,null,null,null,null,null,null,null,null,null,null,null,null,null,null,"2019-01-03"]
[null,null,null,null,null,null,null,null,null,null,null,null,null,null,null,"2019-01-04"]
[null,null,null,null,null,null,null,null,null,null,null,null,null,null,null,"2019-01-05"]
[null,null,null,null,null,null,null,null,null,null,null,null,null,null,null,"2019-01-06"]
[null,null,null,null,null,null,null,null,null,null,null,null,null,null,null,"2019-01-07"]
[null,null,null,null,null,null,null,null,null,null,null,null,null,null,null,"2019-01-08"]
[null,null,null,null,null,null,null,null,null,null,null,null,null,null,null,"2019-01-09"]
[null,null,null,null,null,null,null,null,null,null,null,null,null,null,null,"2019-01-10"]
[null,null,null,null,null,null,null,null,null,null,null,null,null,null,null,"2019-01-11"]
[null,null,null,null,null,null,null,null,null,null,null,null,null,null,null,"2019-01-12"]
[null,null,null,null,null,null,null,null,null,null,null,null,null,null,null,"2019-01-13"]
[null,null,null,null,null,null,null,null,null,null,null,null,null,null,null,"2019-01-14"]
[null,null,null,null,null,null,null,null,null,null,null,null,null,null,null,"2019-01-15"]
[null,null,null,null,null,null,null,null,null,null,null,null,null,null,null,"2019-01-16"]
[null,null,null,null,null,null,null,null,null,null,null,null,null,null,null,"2019-01-17"]
[null,null,null,null,null,null,null,null,null,null,null,null,null,null,null,"2019-01-18"]
[null,null,null,null,null,null,null,null,null,null,null,null,null,null,null,"2019-01-19"]
[null,null,null,null,null,null,null,null,null,null,null,null,null,null,null,"2019-01-20"]
[null,null,null,null,null,null,null,null,null,null,null,null,null,null,null,"2019-01-21"]
[null,null,null,null,null,null,null,null,null,null,null,null,null,null,null,"2019-01-22"]
[null,null,null,null,null,null,null,null,null,null,null,null,null,null,null,"2019-01-23"]
[null,null,null,null,null,null,null,null,null,null,null,null,null,null,null,"2019-01-24"]
[null,null,null,null,null,null,null,null,null,null,null,null,null,null,null,"2019-01-25"]
[null,null,null,null,null,null,null,null,null,null,null,null,null,null,null,"2019-01-26"]
[null,null,null,null,null,null,null,null,null,null,null,null,null,null,null,"2019-01-27"]
[null,null,null,null,null,null,null,null,null,null,null,null,null,null,null,"2019-01-28"]
[null,null,null,null,null,null,null,null,null,null,null,null,null,null,null,"2019-01-29"]
[null,null,null,null,null,null,null,null,null,null,null,null,null,null,null,"2019-01-30"]
[null,null,null,null,null,null,null,null,null,null,null,null,null,null,null,"2019-01-31"]
[null,null,null,null,null,null,null,null,null,null,null,null,null,null,null,"2019-02-01"]
[null,null,null,null,null,null,null,null,null,null,null,null,null,null,null,"2019-02-02"]
[null,null,null,null,null,null,null,null,null,null,null,null,null,null,null,"2019-02-03"]
[null,null,null,null,null,null,null,null,null,null,null,null,null,null,null,"2019-02-04"]
[null,null,null,null,null,null,null,null,null,null,null,null,null,null,null,"2019-02-05"]
[null,null,null,null,null,null,null,null,null,null,null,null,null,null,null,"2019-02-06"]
[null,null,null,null,null,null,null,null,null,null,null,null,null,null,null,"2019-02-07"]
[null,null,null,null,null,null,null,null,null,null,null,null,null,null,null,"2019-02-08"]
[null,null,null,null,null,null,null,null,null,null,null,null,null,null,null,"2019-02-09"]
[null,null,null,null,null,null,null,null,null,null,null,null,null,null,null,"2019-02-10"]
[null,null,null,null,null,null,null,null,null,null,null,null,null,null,null,"2019-02-11"]
[null,null,null,null,null,null,null,null,null,null,null,null,null,null,null,"2019-02-12"]
[null,null,null,null,null,null,null,null,null,null,null,null,null,null,null,"2019-02-13"]
[null,null,null,null,null,null,null,null,null,null,null,null,null,null,null,"2019-02-14"]
[null,null,null,null,null,null,null,null,null,null,null,null,null,null,null,"2019-02-15"]
[null,null,null,null,null,null,null,null,null,null,null,null,null,null,null,"2019-02-16"]
[null,null,null,null,null,null,null,null,null,null,null,null,null,null,null,"2019-02-17"]
[null,null,null,null,null,null,null,null,null,null,null,null,null,null,null,"2019-02-18"]
[null,null,null,null,null,null,null,null,null,null,null,null,null,null,null,"2019-02-19"]
[null,null,null,null,null,null,null,null,null,null,null,null,null,null,null,"2019-02-20"]
[null,null,null,null,null,null,null,null,null,null,null,null,null,null,null,"2019-02-21"]
[null,null,null,null,null,null,null,null,null,null,null,null,null,null,null,"2019-02-22"]
[null,null,null,null,null,null,null,null,null,null,null,null,null,null,null,"2019-02-23"]
[null,null,null,null,null,null,null,null,null,null,null,null,null,null,null,"2019-02-24"]
[null,null,null,null,null,null,null,null,null,null,null,null,null,null,null,"2019-02-25"]
[null,null,null,null,null,null,null,null,null,null,null,null,null,null,null,"2019-02-26"]
[null,null,null,null,null,null,null,null,null,null,null,null,null,null,null,"2019-02-27"]
[null,null,null,null,null,null,null,null,null,null,null,null,null,null,null,"2019-02-28"]
[null,null,null,null,null,null,null,null,null,null,null,null,null,null,null,"2019-03-01"]
[null,null,null,null,null,null,null,null,null,null,null,null,null,null,null,"2019-03-02"]
[null,null,null,null,null,null,null,null,null,null,null,null,null,null,null,"2019-03-03"]
[null,null,null,null,null,null,null,null,null,null,null,null,null,null,null,"2019-03-04"]
[null,null,null,null,null,null,null,null,null,null,null,null,null,null,null,"2019-03-05"]
[null,null,null,null,null,null,null,null,null,null,null,null,null,null,null,"2019-03-06"]
[null,null,null,null,null,null,null,null,null,null,null,null,null,null,null,"2019-03-07"]
[null,null,null,null,null,null,null,null,null,null,null,null,null,null,null,"2019-03-08"]
[null,null,null,null,null,null,null,null,null,null,null,null,null,null,null,"2019-03-09"]
[null,null,null,null,null,null,null,null,null,null,null,null,null,null,null,"2019-03-10"]
[null,null,null,null,null,null,null,null,null,null,null,null,null,null,null,"2019-03-11"]
[null,null,null,null,null,null,null,null,null,null,null,null,null,null,null,"2019-03-12"]
[null,null,null,null,null,null,null,null,null,null,null,null,null,null,null,"2019-03-13"]
[null,null,null,null,null,null,null,null,null,null,null,null,null,null,null,"2019-03-14"]
[null,null,null,null,null,null,null,null,null,null,null,null,null,null,null,"2019-03-15"]
[null,null,null,null,null,null,null,null,null,null,null,null,null,null,null,"2019-03-16"]
[null,null,null,null,null,null,null,null,null,null,null,null,null,null,null,"2019-03-17"]
[null,null,null,null,null,null,null,null,null,null,null,null,null,null,null,"2019-03-18"]
[null,null,null,null,null,null,null,null,null,null,null,null,null,null,null,"2019-03-19"]
[null,null,null,null,null,null,null,null,null,null,null,null,null,null,null,"2019-03-20"]
[null,null,null,null,null,null,null,null,null,null,null,null,null,null,null,"2019-03-21"]
[null,null,null,null,null,null,null,null,null,null,null,null,null,null,null,"2019-03-22"]
[null,null,null,null,null,null,null,null,null,null,null,null,null,null,null,"2019-03-23"]
[null,null,null,null,null,null,null,null,null,null,null,null,null,null,null,"2019-03-24"]
[null,null,null,null,null,null,null,null,null,null,null,null,null,null,null,"2019-03-25"]
[null,null,null,null,null,null,null,null,null,null,null,null,null,null,null,"2019-03-26"]
[null,null,null,null,null,null,null,null,null,null,null,null,null,null,null,"2019-03-27"]
[null,null,null,null,null,null,null,null,null,null,null,null,null,null,null,"2019-03-28"]
[null,null,null,null,null,null,null,null,null,null,null,null,null,null,null,"2019-03-29"]
[null,null,null,null,null,null,null,null,null,null,null,null,null,null,null,"2019-03-30"]
[null,null,null,null,null,null,null,null,null,null,null,null,null,null,null,"2019-03-31"]
[null,null,null,null,null,null,null,null,null,null,null,null,null,null,null,"2019-04-01"]
[null,null,null,null,null,null,null,null,null,null,null,null,null,null,null,"2019-04-02"]

{"sheet":"CONSOLIDADOR","index":1,"n_rows":144,"n_cols":19,"rows_kept":144,"cut":false,"hidden":false,"merged":[[139,0,140,1],[139,2,140,4],[139,5,140,11],[139,18,140,18],[133,0,134,1],[133,2,134,4],[133,5,134,11],[133,18,134,18],[135,0,136,1],[135,2,136,4],[135,5,136,11],[135,18,136,18],[137,0,138,1],[137,2,138,4],[137,5,138,11],[137,18,138,18],[127,0,128,1],[127,2,128,4],[127,5,128,11],[127,18,128,18],[129,0,130,1],[129,2,130,4],[129,5,130,11],[129,18,130,18],[131,0,132,1],[131,2,132,4],[131,5,132,11],[131,18,132,18],[121,0,122,1],[121,2,122,4],[121,5,122,11],[121,18,122,18],[123,0,124,1],[123,2,124,4],[123,5,124,11],[123,18,124,18],[125,0,126,1],[125,2,126,4],[125,5,126,11],[125,18,126,18],[115,0,116,1],[115,2,116,4],[115,5,116,11],[115,18,116,18],[117,0,118,1],[117,2,118,4],[117,5,118,11],[117,18,118,18],[119,0,120,1],[119,2,120,4],[119,5,120,11],[119,18,120,18],[109,0,110,1],[109,2,110,4],[109,5,110,11],[109,18,110,18],[111,0,112,1],[111,2,112,4],[111,5,112,11],[111,18,112,18],[113,0,114,1],[113,2,114,4],[113,5,114,11],[113,18,114,18],[103,0,104,1],[103,2,104,4],[103,5,104,11],[103,18,104,18],[105,0,106,1],[105,2,106,4],[105,5,106,11],[105,18,106,18],[107,0,108,1],[107,2,108,4],[107,5,108,11],[107,18,108,18],[99,0,100,1],[99,2,100,4],[99,5,100,11],[99,18,100,18],[101,0,102,1],[101,2,102,4],[101,5,102,11],[101,18,102,18],[5,9,5,10],[5,11,5,12],[5,13,5,14],[6,4,6,14],[7,0,8,3],[7,7,8,8],[7,12,8,15],[0,0,5,3],[0,4,1,14],[0,15,6,18],[2,4,3,14],[4,4,5,6],[4,7,4,8],[4,9,4,10],[4,11,4,12],[4,13,4,14],[5,7,5,8],[11,0,11,1],[11,2,11,4],[11,5,11,7],[11,8,11,10],[11,11,11,14],[11,15,11,18],[9,0,9,18],[10,0,10,1],[10,2,10,4],[10,5,10,7],[10,8,10,10],[10,11,10,14],[10,15,10,18],[12,0,12,7],[12,8,12,18],[13,0,13,7],[13,8,13,18],[14,0,14,4],[14,5,14,6],[14,8,15,9],[14,10,15,18],[15,0,15,4],[15,5,15,6],[18,0,18,1],[18,2,18,4],[18,5,18,7],[18,8,18,10],[18,11,18,14],[18,15,18,18],[16,0,16,18],[17,0,17,1],[17,2,17,4],[17,5,17,7],[17,8,17,10],[17,11,17,14],[17,15,17,18],[19,0,19,5],[19,6,19,12],[19,13,19,14],[19,15,19,16],[19,17,19,18],[20,0,20,5],[20,6,20,12],[20,13,20,14],[20,15,20,16],[20,17,20,18],[23,0,23,1],[23,2,23,4],[23,5,23,7],[23,8,23,10],[23,11,23,14],[23,15,23,18],[22,0,22,1],[22,2,22,4],[22,5,22,7],[22,8,22,10],[22,11,22,14],[22,15,22,18],[24,0,24,5],[24,6,24,12],[24,13,24,14],[24,15,24,16],[24,17,24,18],[25,0,25,5],[25,6,25,12],[25,13,25,14],[25,15,25,16],[25,17,25,18],[26,0,26,18],[27,0,33,3],[27,4,33,9],[27,12,28,18],[29,12,30,12],[29,13,30,13],[29,14,30,14],[29,15,30,15],[29,16,30,16],[29,17,30,17],[29,18,33,18],[27,10,33,10],[27,11,33,11],[54,0,55,3],[54,4,55,9],[54,12,55,12],[54,13,55,13],[54,14,55,14],[54,15,55,15],[54,16,55,16],[54,17,55,17],[54,18,55,18],[54,10,55,10],[54,11,55,11],[56,0,57,3],[56,4,57,9],[56,12,57,12],[56,13,57,13],[56,14,57,14],[56,15,57,15],[56,16,57,16],[56,17,57,17],[56,18,57,18],[56,11,57,11],[58,0,59,3],[58,4,59,9],[58,12,59,12],[58,13,59,13],[58,14,59,14],[58,15,59,15],[58,16,59,16],[58,17,59,17],[58,18,59,18],[58,10,59,10],[58,11,59,11],[60,0,61,3],[60,4,61,9],[60,12,61,12],[60,13,61,13],[60,14,61,14],[60,15,61,15],[60,16,61,16],[60,17,61,17],[60,18,61,18],[60,10,61,10],[60,11,61,11],[62,0,63,3],[62,4,63,9],[62,12,63,12],[62,13,63,13],[62,14,63,14],[62,15,63,15],[62,16,63,16],[87,0,87,9],[87,10,87,18],[66,18,67,18],[68,0,69,3],[68,4,69,9],[68,12,69,12],[68,13,69,13],[68,14,69,14],[72,4,73,9],[72,12,73,12],[72,13,73,13],[72,14,73,14],[68,15,69,15],[68,16,69,16],[68,17,69,17],[68,18,69,18],[70,0,71,3],[88,0,88,9],[88,10,88,18],[89,0,89,18],[90,0,90,1],[90,2,90,4],[90,5,90,11],[62,17,63,17],[62,18,63,18],[84,0,84,9],[85,0,86,5],[85,6,85,10],[86,6,86,10],[64,13,65,13],[64,14,65,14],[64,17,65,17],[64,18,65,18],[66,0,67,3],[66,4,67,9],[66,12,67,12],[66,13,67,13],[66,14,67,14],[66,15,67,15],[66,16,67,16],[66,17,67,17],[143,0,144,11],[143,12,144,18],[146,19,147,19],[148,19,149,19],[150,19,151,19],[21,0,21,16],[64,0,65,3],[64,4,65,9],[64,12,65,12],[141,0,141,11],[64,15,65,15],[64,16,65,16],[70,4,71,9],[70,12,71,12],[70,13,71,13],[70,14,71,14],[34,15,35,15],[34,16,35,16],[34,17,35,17],[34,18,35,18],[36,0,37,3],[36,4,37,9],[95,0,96,1],[95,2,96,4],[34,0,35,3],[34,4,35,9],[34,12,35,12],[34,13,35,13],[34,14,35,14],[36,15,37,15],[34,10,35,10],[34,11,35,11],[141,18,142,18],[142,0,142,11],[95,5,96,11],[95,18,96,18],[97,0,98,1],[97,2,98,4],[97,5,98,11],[97,18,98,18],[91,0,92,1],[91,2,92,4],[91,5,92,11],[91,18,92,18],[93,0,94,1],[93,2,94,4],[93,5,94,11],[93,18,94,18],[36,16,37,16],[36,17,37,17],[36,18,37,18],[38,0,39,3],[38,4,39,9],[38,12,39,12],[38,13,39,13],[38,14,39,14],[38,15,39,15],[38,16,39,16],[38,17,39,17],[38,18,39,18],[36,10,37,10],[38,10,39,10],[36,11,37,11],[38,11,39,11],[36,12,37,12],[36,13,37,13],[36,14,37,14],[40,0,41,3],[40,4,41,9],[40,12,41,12],[40,13,41,13],[40,14,41,14],[42,18,43,18],[44,0,45,3],[44,4,45,9],[44,12,45,12],[44,13,45,13],[44,14,45,14],[40,15,41,15],[40,16,41,16],[40,17,41,17],[40,18,41,18],[42,0,43,3],[42,4,43,9],[42,12,43,12],[42,13,43,13],[42,14,43,14],[42,15,43,15],[42,16,43,16],[42,17,43,17],[40,11,41,11],[46,18,47,18],[48,0,49,3],[48,4,49,9],[48,12,49,12],[48,13,49,13],[48,14,49,14],[44,15,45,15],[44,16,45,16],[44,17,45,17],[44,18,45,18],[46,0,47,3],[46,4,47,9],[46,12,47,12],[46,13,47,13],[46,14,47,14],[50,18,51,18],[52,0,53,3],[52,4,53,9],[52,12,53,12],[52,13,53,13],[52,14,53,14],[48,15,49,15],[48,16,49,16],[48,17,49,17],[48,18,49,18],[50,0,51,3],[50,4,51,9],[50,12,51,12],[50,13,51,13],[50,14,51,14],[50,11,51,11],[52,10,53,10],[52,11,53,11],[48,10,49,10],[48,11,49,11],[50,10,51,10],[74,18,75,18],[76,0,77,3],[76,4,77,9],[76,12,77,12],[76,13,77,13],[76,14,77,14],[52,15,53,15],[52,16,53,16],[52,17,53,17],[52,18,53,18],[74,0,75,3],[74,4,75,9],[74,12,75,12],[74,13,75,13],[74,14,75,14],[72,15,73,15],[72,16,73,16],[72,17,73,17],[72,18,73,18],[70,15,71,15],[70,16,71,16],[70,17,71,17],[70,18,71,18],[72,0,73,3],[78,18,79,18],[80,0,81,3],[80,4,81,9],[80,12,81,12],[80,13,81,13],[80,14,81,14],[76,15,77,15],[76,16,77,16],[76,17,77,17],[76,18,77,18],[78,0,79,3],[78,4,79,9],[78,12,79,12],[78,13,79,13],[78,14,79,14],[78,11,79,11],[78,10,79,10],[78,15,79,15],[78,16,79,16],[78,17,79,17],[82,18,83,18],[80,15,81,15],[80,16,81,16],[80,17,81,17],[80,18,81,18],[82,0,83,3],[82,4,83,9],[82,12,83,12],[82,13,83,13],[82,14,83,14],[80,10,81,10],[80,11,81,11],[82,10,83,10],[82,11,83,11],[82,15,83,15],[82,16,83,16],[82,17,83,17],[74,15,75,15],[74,16,75,16],[74,17,75,17],[50,15,51,15],[50,16,51,16],[50,17,51,17],[46,15,47,15],[46,16,47,16],[46,17,47,17],[42,11,43,11],[44,11,45,11],[46,11,47,11],[40,10,41,10],[42,10,43,10],[44,10,45,10],[46,10,47,10],[62,10,63,10],[62,11,63,11],[56,10,57,10],[64,10,65,10],[72,11,73,11],[74,10,75,10],[74,11,75,11],[76,10,77,10],[76,11,77,11],[72,10,73,10],[64,11,65,11],[66,10,67,10],[66,11,67,11],[68,10,69,10],[68,11,69,11],[70,10,71,10],[70,11,71,11]]}
[null,null,null,null,"                                                                                                                                                                           COMISIÓN NACIONAL DEL SERVICIO CIVIL\n    ",null,null,null,null,null,null,null,null,null,null,"INSERTE EL LOGOTIPO DE SU ENTIDAD"]
[]
[null,null,null,null,"FORMATO DE CONSOLIDACIÓN - AJUSTE A COMPROMISOS"]
[]
[null,null,null,null,"PROCESO: EVALUACIÓN DEL DESEMPEÑO LABORAL",null,null,"Código:  ",null,"No Aplica",null,"Página",null,"1 de 1"]
[null,null,null,null,null,null,null,"Fecha de emisión: ",null,"No Aplica",null,"Versión: ",null,"1.0"]
[]
["PERÍODO DE EVALUACIÓN",null,null,null,"DÍA","MES","AÑO","al",null,"DÍA","MES","AÑO","FECHA DE CALIFICACIÓN",null,null,null,"DÍA","MES","AÑO"]
[]
["I. IDENTIFICACIÓN DEL EVALUADO"]
["Tipo de Documento",null,"Número de identificación",null,null,"Primer apellido",null,null,"Segundo apellido",null,null,"Primer nombre",null,null,null,"Otros nombres"]
["Cédula de ciudadanía"]
["Dependencia o área a la que pertenece el evaluado",null,null,null,null,null,null,null,"Denominación del empleo"]
[]
["Nivel jerárquico",null,null,null,null,"Código",null,"Grado","Propósito principal del empleo"]
[]
["II. IDENTIFICACIÓN EVALUADOR. (Jefe inmediato)"]
["Tipo de documento",null,"Número de identificación",null,null,"Primer apellido",null,null,"Segundo apellido",null,null,"Primer nombre",null,null,null,"Otros nombres"]
["Cédula de ciudadanía"]
[" Área o Dependencia a la que pertenece el evaluador",null,null,null,null,null,"Denominación del empleo",null,null,null,null,null,null,"Código",null,"Grado",null,"Nivel jerárquico"]
[]
["III. IDENTIFICACIÓN EVALUADOR (Servidor público de Libre Nombramiento y Remoción en caso de constituir Comisión Evaluadora)",null,null,null,null,null,null,null,null,null,null,null,null,null,null,null,null,null,"NO"]
["Tipo de documento",null,"Número de identificación",null,null,"Primer apellido",null,null,"Segundo apellido",null,null,"Primer nombre",null,null,null,"Otros nombres"]
["Cédula de ciudadanía",null,222,null,null,"Flores",null,null,"Castro",null,null,"Daniela"]
["Dependencia o área a la que pertenece el evaluador",null,null,null,null,null,"Denominación del empleo",null,null,null,null,null,null,"Código",null,"Grado",null,"Nivel jerárquico"]
["Talento Humano",null,null,null,null,null,"Director ",null,null,null,null,null,null,1296,null,11,null,"DIRECTIVO"]
["IV. COMPROMISOS LABORALES"]
["Metas de la Dependencia a las cuales contribuye el empleo",null,null,null,"Compromisos Laborales.",null,null,null,null,null,"Peso porcentual del compromiso","Peso porcentual del período","Calificación Eventuales"]
[]
[null,null,null,null,null,null,null,null,null,null,null,null,"No. calificación","1ª","2ª","3ª","4ª","5ª","Total Compromisos"]
[]
[null,null,null,null,null,null,null,null,null,null,null,null,"Causal"]
[null,null,null,null,null,null,null,null,null,null,null,null,"Desde"]
[null,null,null,null,null,null,null,null,null,null,null,null,"Hasta"]
[null,null,null,null,null,null,null,null,null,null,null,{"$f":"(K35*(IF(N35<>\"\",$N$87,IF(O35<>\"\",$O$87,IF(P35<>\"\",$P$87,IF(Q35<>\"\",$Q$87,IF(R35<>\"\",$R$87,0)))))))","v":0},null,null,null,null,null,null,{"$f":"L35*IF(N35<>\"\",N35,IF(O35<>\"\",O35,IF(P35<>\"\",P35,IF(Q35<>\"\",Q35,IF(R35<>\"\",R35,0)))))","v":0}]
[]
[null,null,null,null,null,null,null,null,null,null,null,{"$f":"(K37*(IF(N37<>\"\",$N$87,IF(O37<>\"\",$O$87,IF(P37<>\"\",$P$87,IF(Q37<>\"\",$Q$87,IF(R37<>\"\",$R$87,0)))))))","v":0},null,null,null,null,null,null,{"$f":"L37*IF(N37<>\"\",N37,IF(O37<>\"\",O37,IF(P37<>\"\",P37,IF(Q37<>\"\",Q37,IF(R37<>\"\",R37,0)))))","v":0}]
[]
[null,null,null,null,null,null,null,null,null,null,null,{"$f":"(K39*(IF(N39<>\"\",$N$87,IF(O39<>\"\",$O$87,IF(P39<>\"\",$P$87,IF(Q39<>\"\",$Q$87,IF(R39<>\"\",$R$87,0)))))))","v":0},null,null,null,null,null,null,{"$f":"L39*IF(N39<>\"\",N39,IF(O39<>\"\",O39,IF(P39<>\"\",P39,IF(Q39<>\"\",Q39,IF(R39<>\"\",R39,0)))))","v":0}]
[]
[null,null,null,null,null,null,null,null,null,null,null,{"$f":"(K41*(IF(N41<>\"\",$N$87,IF(O41<>\"\",$O$87,IF(P41<>\"\",$P$87,IF(Q41<>\"\",$Q$87,IF(R41<>\"\",$R$87,0)))))))","v":0},null,null,null,null,null,null,{"$f":"L41*IF(N41<>\"\",N41,IF(O41<>\"\",O41,IF(P41<>\"\",P41,IF(Q41<>\"\",Q41,IF(R41<>\"\",R41,0)))))","v":0}]
[]
[null,null,null,null,null,null,null,null,null,null,null,{"$f":"(K43*(IF(N43<>\"\",$N$87,IF(O43<>\"\",$O$87,IF(P43<>\"\",$P$87,IF(Q43<>\"\",$Q$87,IF(R43<>\"\",$R$87,0)))))))","v":0},null,null,null,null,null,null,{"$f":"L43*IF(N43<>\"\",N43,IF(O43<>\"\",O43,IF(P43<>\"\",P43,IF(Q43<>\"\",Q43,IF(R43<>\"\",R43,0)))))","v":0}]
[]
[null,null,null,null,null,null,null,null,null,null,null,{"$f":"(K45*(IF(N45<>\"\",$N$87,IF(O45<>\"\",$O$87,IF(P45<>\"\",$P$87,IF(Q45<>\"\",$Q$87,IF(R45<>\"\",$R$87,0)))))))","v":0},null,null,null,null,null,null,{"$f":"L45*IF(N45<>\"\",N45,IF(O45<>\"\",O45,IF(P45<>\"\",P45,IF(Q45<>\"\",Q45,IF(R45<>\"\",R45,0)))))","v":0}]
[]
[null,null,null,null,null,null,null,null,null,null,null,{"$f":"(K47*(IF(N47<>\"\",$N$87,IF(O47<>\"\",$O$87,IF(P47<>\"\",$P$87,IF(Q47<>\"\",$Q$87,IF(R47<>\"\",$R$87,0)))))))","v":0},null,null,null,null,null,null,{"$f":"L47*IF(N47<>\"\",N47,IF(O47<>\"\",O47,IF(P47<>\"\",P47,IF(Q47<>\"\",Q47,IF(R47<>\"\",R47,0)))))","v":0}]
[]
[null,null,null,null,null,null,null,null,null,null,null,{"$f":"(K49*(IF(N49<>\"\",$N$87,IF(O49<>\"\",$O$87,IF(P49<>\"\",$P$87,IF(Q49<>\"\",$Q$87,IF(R49<>\"\",$R$87,0)))))))","v":0},null,null,null,null,null,null,{"$f":"L49*IF(N49<>\"\",N49,IF(O49<>\"\",O49,IF(P49<>\"\",P49,IF(Q49<>\"\",Q49,IF(R49<>\"\",R49,0)))))","v":0}]
[]
[null,null,null,null,null,null,null,null,null,null,null,{"$f":"(K51*(IF(N51<>\"\",$N$87,IF(O51<>\"\",$O$87,IF(P51<>\"\",$P$87,IF(Q51<>\"\",$Q$87,IF(R51<>\"\",$R$87,0)))))))","v":0},null,null,null,null,null,null,{"$f":"L51*IF(N51<>\"\",N51,IF(O51<>\"\",O51,IF(P51<>\"\",P51,IF(Q51<>\"\",Q51,IF(R51<>\"\",R51,0)))))","v":0}]
[]
[null,null,null,null,null,null,null,null,null,null,null,{"$f":"(K53*(IF(N53<>\"\",$N$87,IF(O53<>\"\",$O$87,IF(P53<>\"\",$P$87,IF(Q53<>\"\",$Q$87,IF(R53<>\"\",$R$87,0)))))))","v":0},null,null,null,null,null,null,{"$f":"L53*IF(N53<>\"\",N53,IF(O53<>\"\",O53,IF(P53<>\"\",P53,IF(Q53<>\"\",Q53,IF(R53<>\"\",R53,0)))))","v":0}]
[]
[null,null,null,null,null,null,null,null,null,null,null,{"$f":"(K55*(IF(N55<>\"\",$N$87,IF(O55<>\"\",$O$87,IF(P55<>\"\",$P$87,IF(Q55<>\"\",$Q$87,IF(R55<>\"\",$R$87,0)))))))","v":0},null,null,null,null,null,null,{"$f":"L55*IF(N55<>\"\",N55,IF(O55<>\"\",O55,IF(P55<>\"\",P55,IF(Q55<>\"\",Q55,IF(R55<>\"\",R55,0)))))","v":0}]
[]
[null,null,null,null,null,null,null,null,null,null,null,{"$f":"(K57*(IF(N57<>\"\",$N$87,IF(O57<>\"\",$O$87,IF(P57<>\"\",$P$87,IF(Q57<>\"\",$Q$87,IF(R57<>\"\",$R$87,0)))))))","v":0},null,null,null,null,null,null,{"$f":"L57*IF(N57<>\"\",N57,IF(O57<>\"\",O57,IF(P57<>\"\",P57,IF(Q57<>\"\",Q57,IF(R57<>\"\",R57,0)))))","v":0}]
[]
[null,null,null,null,null,null,null,null,null,null,null,{"$f":"(K59*(IF(N59<>\"\",$N$87,IF(O59<>\"\",$O$87,IF(P59<>\"\",$P$87,IF(Q59<>\"\",$Q$87,IF(R59<>\"\",$R$87,0)))))))","v":0},null,null,null,null,null,null,{"$f":"L59*IF(N59<>\"\",N59,IF(O59<>\"\",O59,IF(P59<>\"\",P59,IF(Q59<>\"\",Q59,IF(R59<>\"\",R59,0)))))","v":0}]
[]
[null,null,null,null,null,null,null,null,null,null,null,{"$f":"(K61*(IF(N61<>\"\",$N$87,IF(O61<>\"\",$O$87,IF(P61<>\"\",$P$87,IF(Q61<>\"\",$Q$87,IF(R61<>\"\",$R$87,0)))))))","v":0},null,null,null,null,null,null,{"$f":"L61*IF(N61<>\"\",N61,IF(O61<>\"\",O61,IF(P61<>\"\",P61,IF(Q61<>\"\",Q61,IF(R61<>\"\",R61,0)))))","v":0}]
[]
[null,null,null,null,null,null,null,null,null,null,null,{"$f":"(K63*(IF(N63<>\"\",$N$87,IF(O63<>\"\",$O$87,IF(P63<>\"\",$P$87,IF(Q63<>\"\",$Q$87,IF(R63<>\"\",$R$87,0)))))))","v":0},null,null,null,null,null,null,{"$f":"L63*IF(N63<>\"\",N63,IF(O63<>\"\",O63,IF(P63<>\"\",P63,IF(Q63<>\"\",Q63,IF(R63<>\"\",R63,0)))))","v":0}]
[]
[null,null,null,null,null,null,null,null,null,null,null,{"$f":"(K65*(IF(N65<>\"\",$N$87,IF(O65<>\"\",$O$87,IF(P65<>\"\",$P$87,IF(Q65<>\"\",$Q$87,IF(R65<>\"\",$R$87,0)))))))","v":0},null,null,null,null,null,null,{"$f":"L65*IF(N65<>\"\",N65,IF(O65<>\"\",O65,IF(P65<>\"\",P65,IF(Q65<>\"\",Q65,IF(R65<>\"\",R65,0)))))","v":0}]
[]
[null,null,null,null,null,null,null,null,null,null,null,{"$f":"(K67*(IF(N67<>\"\",$N$87,IF(O67<>\"\",$O$87,IF(P67<>\"\",$P$87,IF(Q67<>\"\",$Q$87,IF(R67<>\"\",$R$87,0)))))))","v":0},null,null,null,null,null,null,{"$f":"L67*IF(N67<>\"\",N67,IF(O67<>\"\",O67,IF(P67<>\"\",P67,IF(Q67<>\"\",Q67,IF(R67<>\"\",R67,0)))))","v":0}]
[]
[null,null,null,null,null,null,null,null,null,null,null,{"$f":"(K69*(IF(N69<>\"\",$N$87,IF(O69<>\"\",$O$87,IF(P69<>\"\",$P$87,IF(Q69<>\"\",$Q$87,IF(R69<>\"\",$R$87,0)))))))","v":0},null,null,null,null,null,null,{"$f":"L69*IF(N69<>\"\",N69,IF(O69<>\"\",O69,IF(P69<>\"\",P69,IF(Q69<>\"\",Q69,IF(R69<>\"\",R69,0)))))","v":0}]
[]
[null,null,null,null,null,null,null,null,null,null,null,{"$f":"(K71*(IF(N71<>\"\",$N$87,IF(O71<>\"\",$O$87,IF(P71<>\"\",$P$87,IF(Q71<>\"\",$Q$87,IF(R71<>\"\",$R$87,0)))))))","v":0},null,null,null,null,null,null,{"$f":"L71*IF(N71<>\"\",N71,IF(O71<>\"\",O71,IF(P71<>\"\",P71,IF(Q71<>\"\",Q71,IF(R71<>\"\",R71,0)))))","v":0}]
[]
[null,null,null,null,null,null,null,null,null,null,null,{"$f":"(K73*(IF(N73<>\"\",$N$87,IF(O73<>\"\",$O$87,IF(P73<>\"\",$P$87,IF(Q73<>\"\",$Q$87,IF(R73<>\"\",$R$87,0)))))))","v":0},null,null,null,null,null,null,{"$f":"L73*IF(N73<>\"\",N73,IF(O73<>\"\",O73,IF(P73<>\"\",P73,IF(Q73<>\"\",Q73,IF(R73<>\"\",R73,0)))))","v":0}]
[]
[null,null,null,null,null,null,null,null,null,null,null,{"$f":"(K75*(IF(N75<>\"\",$N$87,IF(O75<>\"\",$O$87,IF(P75<>\"\",$P$87,IF(Q75<>\"\",$Q$87,IF(R75<>\"\",$R$87,0)))))))","v":0},null,null,null,null,null,null,{"$f":"L75*IF(N75<>\"\",N75,IF(O75<>\"\",O75,IF(P75<>\"\",P75,IF(Q75<>\"\",Q75,IF(R75<>\"\",R75,0)))))","v":0}]
[]
[22,null,null,null,null,null,null,null,null,null,null,{"$f":"(K77*(IF(N77<>\"\",$N$87,IF(O77<>\"\",$O$87,IF(P77<>\"\",$P$87,IF(Q77<>\"\",$Q$87,IF(R77<>\"\",$R$87,0)))))))","v":0},null,null,null,null,null,null,{"$f":"L77*IF(N77<>\"\",N77,IF(O77<>\"\",O77,IF(P77<>\"\",P77,IF(Q77<>\"\",Q77,IF(R77<>\"\",R77,0)))))","v":0}]
[]
[23,null,null,null,null,null,null,null,null,null,null,{"$f":"(K79*(IF(N79<>\"\",$N$87,IF(O79<>\"\",$O$87,IF(P79<>\"\",$P$87,IF(Q79<>\"\",$Q$87,IF(R79<>\"\",$R$87,0)))))))","v":0},null,null,null,null,null,null,{"$f":"L79*IF(N79<>\"\",N79,IF(O79<>\"\",O79,IF(P79<>\"\",P79,IF(Q79<>\"\",Q79,IF(R79<>\"\",R79,0)))))","v":0}]
[]
[24,null,null,null,null,null,null,null,null,null,null,{"$f":"(K81*(IF(N81<>\"\",$N$87,IF(O81<>\"\",$O$87,IF(P81<>\"\",$P$87,IF(Q81<>\"\",$Q$87,IF(R81<>\"\",$R$87,0)))))))","v":0},null,null,null,null,null,null,{"$f":"L81*IF(N81<>\"\",N81,IF(O81<>\"\",O81,IF(P81<>\"\",P81,IF(Q81<>\"\",Q81,IF(R81<>\"\",R81,0)))))","v":0}]
[]
[25,null,null,null,null,null,null,null,null,null,null,{"$f":"(K83*(IF(N83<>\"\",$N$87,IF(O83<>\"\",$O$87,IF(P83<>\"\",$P$87,IF(Q83<>\"\",$Q$87,IF(R83<>\"\",$R$87,0)))))))","v":0},null,null,null,null,null,null,{"$f":"L83*IF(N83<>\"\",N83,IF(O83<>\"\",O83,IF(P83<>\"\",P83,IF(Q83<>\"\",Q83,IF(R83<>\"\",R83,0)))))","v":0}]
[]
["TOTALES",null,null,null,null,null,null,null,null,null,{"$f":"SUM(K35:K84)","v":0},{"$f":"SUM(L35:L84)","v":0},null,{"$f":"SUMIF(N35:N84,\">0\",$S$35:$S$84)","v":0},{"$f":"SUMIF(O35:O84,\">0\",$S$35:$S$84)","v":0},0,0,0]
["Días Efectivamente Laborados",null,null,null,null,null,"Total Días Laborados de cada Ev. Eventual",null,null,null,null,{"$f":"IF(OR(SUM(N86:R86)<=30,SUM(N86:R86)>180),\"No Aplica\",SUM(M86:R86))","v":"No Aplica"}]
[null,null,null,null,null,null,"% Participación Días Laborados de cada Evaluación. Eventual",null,null,null,null,{"$f":"IFERROR(+L86/$L$86,0)","v":0},null,{"$f":"IFERROR(+N86/$L$86,0)","v":0},{"$f":"IFERROR(+O86/$L$86,0)","v":0},0,0,0]
["CALIFICACIÓN EVALUACIÒN PRIMER SEMESTRE (Sobre 100) ",null,null,null,null,null,null,null,null,null,{"$f":"SUM(S35:S84)","v":0}]
["CALIFICACIÓN TOTAL COMPROMISOS LABORALES",null,null,null,null,null,null,null,null,null,{"$f":"K88*0.8","v":0}]
["V. COMPETENCIAS COMPORTAMENTALES"]
["COMPETENCIA",null,"DEFINICIÓN ",null,null,"CONDUCTAS ASOCIADAS",null,null,null,null,null,null,null,"1a.","2a.","3a.","4a.","5a.","Total"]
[null,null,{"$f":"VLOOKUP(A92,Hoja1!$A$2:$C$28,2,FALSE)","v":{"$error":"#N/A"}},null,null,{"$f":"VLOOKUP(A92,Hoja1!$A$2:$C$28,3,FALSE)","v":{"$error":"#N/A"}},null,null,null,null,null,null,null,null,null,null,null,null,{"$f":"+M93*M$143+N93*N$143+O93*O$143+P93*P$143+Q93*Q$143+R93*R$143","v":0}]
[null,null,null,null,null,null,null,null,null,null,null,null,null,{"$f":"IFERROR(VLOOKUP(N92,Hoja4!$A$254:$B$258,2,FALSE),0)","v":0},{"$f":"IFERROR(VLOOKUP(O92,Hoja4!$A$254:$B$258,2,FALSE),0)","v":0},{"$f":"IFERROR(VLOOKUP(P92,Hoja4!$A$254:$B$258,2,FALSE),0)","v":0},{"$f":"IFERROR(VLOOKUP(Q92,Hoja4!$A$254:$B$258,2,FALSE),0)","v":0},{"$f":"IFERROR(VLOOKUP(R92,Hoja4!$A$254:$B$258,2,FALSE),0)","v":0}]
[null,null,{"$f":"VLOOKUP(A94,Hoja1!$A$2:$C$28,2,FALSE)","v":{"$error":"#N/A"}},null,null,{"$f":"VLOOKUP(A94,Hoja1!$A$2:$C$28,3,FALSE)","v":{"$error":"#N/A"}},null,null,null,null,null,null,null,null,null,null,null,null,{"$f":"+M95*M$143+N95*N$143+O95*O$143+P95*P$143+Q95*Q$143+R95*R$143","v":0}]
[null,null,null,null,null,null,null,null,null,null,null,null,null,{"$f":"IFERROR(VLOOKUP(N94,Hoja4!$A$254:$B$258,2,FALSE),0)","v":0},{"$f":"IFERROR(VLOOKUP(O94,Hoja4!$A$254:$B$258,2,FALSE),0)","v":0},{"$f":"IFERROR(VLOOKUP(P94,Hoja4!$A$254:$B$258,2,FALSE),0)","v":0},{"$f":"IFERROR(VLOOKUP(Q94,Hoja4!$A$254:$B$258,2,FALSE),0)","v":0},{"$f":"IFERROR(VLOOKUP(R94,Hoja4!$A$254:$B$258,2,FALSE),0)","v":0}]
[null,null,{"$f":"VLOOKUP(A96,Hoja1!$A$2:$C$28,2,FALSE)","v":{"$error":"#N/A"}},null,null,{"$f":"VLOOKUP(A96,Hoja1!$A$2:$C$28,3,FALSE)","v":{"$error":"#N/A"}},null,null,null,null,null,null,null,null,null,null,null,null,{"$f":"+M97*M$143+N97*N$143+O97*O$143+P97*P$143+Q97*Q$143+R97*R$143","v":0}]
[null,null,null,null,null,null,null,null,null,null,null,null,null,{"$f":"IFERROR(VLOOKUP(N96,Hoja4!$A$254:$B$258,2,FALSE),0)","v":0},{"$f":"IFERROR(VLOOKUP(O96,Hoja4!$A$254:$B$258,2,FALSE),0)","v":0},{"$f":"IFERROR(VLOOKUP(P96,Hoja4!$A$254:$B$258,2,FALSE),0)","v":0},{"$f":"IFERROR(VLOOKUP(Q96,Hoja4!$A$254:$B$258,2,FALSE),0)","v":0},{"$f":"IFERROR(VLOOKUP(R96,Hoja4!$A$254:$B$258,2,FALSE),0)","v":0}]
[null,null,{"$f":"VLOOKUP(A98,Hoja1!$A$2:$C$28,2,FALSE)","v":{"$error":"#N/A"}},null,null,{"$f":"VLOOKUP(A98,Hoja1!$A$2:$C$28,3,FALSE)","v":{"$error":"#N/A"}},null,null,null,null,null,null,null,null,null,null,null,null,{"$f":"+M99*M$143+N99*N$143+O99*O$143+P99*P$143+Q99*Q$143+R99*R$143","v":0}]
[null,null,null,null,null,null,null,null,null,null,null,null,null,{"$f":"IFERROR(VLOOKUP(N98,Hoja4!$A$254:$B$258,2,FALSE),0)","v":0},{"$f":"IFERROR(VLOOKUP(O98,Hoja4!$A$254:$B$258,2,FALSE),0)","v":0},{"$f":"IFERROR(VLOOKUP(P98,Hoja4!$A$254:$B$258,2,FALSE),0)","v":0},{"$f":"IFERROR(VLOOKUP(Q98,Hoja4!$A$254:$B$258,2,FALSE),0)","v":0},{"$f":"IFERROR(VLOOKUP(R98,Hoja4!$A$254:$B$258,2,FALSE),0)","v":0}]
[null,null,{"$f":"VLOOKUP(A100,Hoja1!$A$2:$C$28,2,FALSE)","v":{"$error":"#N/A"}},null,null,{"$f":"VLOOKUP(A100,Hoja1!$A$2:$C$28,3,FALSE)","v":{"$error":"#N/A"}},null,null,null,null,null,null,null,null,null,null,null,null,{"$f":"+M101*M$143+N101*N$143+O101*O$143+P101*P$143+Q101*Q$143+R101*R$143","v":0}]
[null,null,null,null,null,null,null,null,null,null,null,null,null,{"$f":"IFERROR(VLOOKUP(N100,Hoja4!$A$254:$B$258,2,FALSE),0)","v":0},{"$f":"IFERROR(VLOOKUP(O100,Hoja4!$A$254:$B$258,2,FALSE),0)","v":0},{"$f":"IFERROR(VLOOKUP(P100,Hoja4!$A$254:$B$258,2,FALSE),0)","v":0},{"$f":"IFERROR(VLOOKUP(Q100,Hoja4!$A$254:$B$258,2,FALSE),0)","v":0},{"$f":"IFERROR(VLOOKUP(R100,Hoja4!$A$254:$B$258,2,FALSE),0)","v":0}]
[null,null,{"$f":"VLOOKUP(A102,Hoja1!$A$2:$C$28,2,FALSE)","v":{"$error":"#N/A"}},null,null,{"$f":"VLOOKUP(A102,Hoja1!$A$2:$C$28,3,FALSE)","v":{"$error":"#N/A"}},null,null,null,null,null,null,null,null,null,null,null,null,{"$f":"+M103*M$143+N103*N$143+O103*O$143+P103*P$143+Q103*Q$143+R103*R$143","v":0}]
[null,null,null,null,null,null,null,null,null,null,null,null,null,{"$f":"IFERROR(VLOOKUP(N102,Hoja4!$A$254:$B$258,2,FALSE),0)","v":0},{"$f":"IFERROR(VLOOKUP(O102,Hoja4!$A$254:$B$258,2,FALSE),0)","v":0},{"$f":"IFERROR(VLOOKUP(P102,Hoja4!$A$254:$B$258,2,FALSE),0)","v":0},{"$f":"IFERROR(VLOOKUP(Q102,Hoja4!$A$254:$B$258,2,FALSE),0)","v":0},{"$f":"IFERROR(VLOOKUP(R102,Hoja4!$A$254:$B$258,2,FALSE),0)","v":0}]
[null,null,{"$f":"VLOOKUP(A104,Hoja1!$A$2:$C$28,2,FALSE)","v":{"$error":"#N/A"}},null,null,{"$f":"VLOOKUP(A104,Hoja1!$A$2:$C$28,3,FALSE)","v":{"$error":"#N/A"}},null,null,null,null,null,null,null,null,null,null,null,null,{"$f":"+M105*M$143+N105*N$143+O105*O$143+P105*P$143+Q105*Q$143+R105*R$143","v":0}]
[null,null,null,null,null,null,null,null,null,null,null,null,null,{"$f":"IFERROR(VLOOKUP(N104,Hoja4!$A$254:$B$258,2,FALSE),0)","v":0},{"$f":"IFERROR(VLOOKUP(O104,Hoja4!$A$254:$B$258,2,FALSE),0)","v":0},{"$f":"IFERROR(VLOOKUP(P104,Hoja4!$A$254:$B$258,2,FALSE),0)","v":0},{"$f":"IFERROR(VLOOKUP(Q104,Hoja4!$A$254:$B$258,2,FALSE),0)","v":0},{"$f":"IFERROR(VLOOKUP(R104,Hoja4!$A$254:$B$258,2,FALSE),0)","v":0}]
[null,null,{"$f":"VLOOKUP(A106,Hoja1!$A$2:$C$28,2,FALSE)","v":{"$error":"#N/A"}},null,null,{"$f":"VLOOKUP(A106,Hoja1!$A$2:$C$28,3,FALSE)","v":{"$error":"#N/A"}},null,null,null,null,null,null,null,null,null,null,null,null,{"$f":"+M107*M$143+N107*N$143+O107*O$143+P107*P$143+Q107*Q$143+R107*R$143","v":0}]
[null,null,null,null,null,null,null,null,null,null,null,null,null,{"$f":"IFERROR(VLOOKUP(N106,Hoja4!$A$254:$B$258,2,FALSE),0)","v":0},{"$f":"IFERROR(VLOOKUP(O106,Hoja4!$A$254:$B$258,2,FALSE),0)","v":0},{"$f":"IFERROR(VLOOKUP(P106,Hoja4!$A$254:$B$258,2,FALSE),0)","v":0},{"$f":"IFERROR(VLOOKUP(Q106,Hoja4!$A$254:$B$258,2,FALSE),0)","v":0},{"$f":"IFERROR(VLOOKUP(R106,Hoja4!$A$254:$B$258,2,FALSE),0)","v":0}]
[null,null,{"$f":"VLOOKUP(A108,Hoja1!$A$2:$C$28,2,FALSE)","v":{"$error":"#N/A"}},null,null,{"$f":"VLOOKUP(A108,Hoja1!$A$2:$C$28,3,FALSE)","v":{"$error":"#N/A"}},null,null,null,null,null,null,null,null,null,null,null,null,{"$f":"+M109*M$143+N109*N$143+O109*O$143+P109*P$143+Q109*Q$143+R109*R$143","v":0}]
[null,null,null,null,null,null,null,null,null,null,null,null,null,{"$f":"IFERROR(VLOOKUP(N108,Hoja4!$A$254:$B$258,2,FALSE),0)","v":0},{"$f":"IFERROR(VLOOKUP(O108,Hoja4!$A$254:$B$258,2,FALSE),0)","v":0},{"$f":"IFERROR(VLOOKUP(P108,Hoja4!$A$254:$B$258,2,FALSE),0)","v":0},{"$f":"IFERROR(VLOOKUP(Q108,Hoja4!$A$254:$B$258,2,FALSE),0)","v":0},{"$f":"IFERROR(VLOOKUP(R108,Hoja4!$A$254:$B$258,2,FALSE),0)","v":0}]
[null,null,{"$f":"VLOOKUP(A110,Hoja1!$A$2:$C$28,2,FALSE)","v":{"$error":"#N/A"}},null,null,{"$f":"VLOOKUP(A110,Hoja1!$A$2:$C$28,3,FALSE)","v":{"$error":"#N/A"}},null,null,null,null,null,null,null,null,null,null,null,null,{"$f":"+M111*M$143+N111*N$143+O111*O$143+P111*P$143+Q111*Q$143+R111*R$143","v":0}]
[null,null,null,null,null,null,null,null,null,null,null,null,null,{"$f":"IFERROR(VLOOKUP(N110,Hoja4!$A$254:$B$258,2,FALSE),0)","v":0},{"$f":"IFERROR(VLOOKUP(O110,Hoja4!$A$254:$B$258,2,FALSE),0)","v":0},{"$f":"IFERROR(VLOOKUP(P110,Hoja4!$A$254:$B$258,2,FALSE),0)","v":0},{"$f":"IFERROR(VLOOKUP(Q110,Hoja4!$A$254:$B$258,2,FALSE),0)","v":0},{"$f":"IFERROR(VLOOKUP(R110,Hoja4!$A$254:$B$258,2,FALSE),0)","v":0}]
[null,null,{"$f":"VLOOKUP(A112,Hoja1!$A$2:$C$28,2,FALSE)","v":{"$error":"#N/A"}},null,null,{"$f":"VLOOKUP(A112,Hoja1!$A$2:$C$28,3,FALSE)","v":{"$error":"#N/A"}},null,null,null,null,null,null,null,null,null,null,null,null,{"$f":"+M113*M$143+N113*N$143+O113*O$143+P113*P$143+Q113*Q$143+R113*R$143","v":0}]
[null,null,null,null,null,null,null,null,null,null,null,null,null,{"$f":"IFERROR(VLOOKUP(N112,Hoja4!$A$254:$B$258,2,FALSE),0)","v":0},{"$f":"IFERROR(VLOOKUP(O112,Hoja4!$A$254:$B$258,2,FALSE),0)","v":0},{"$f":"IFERROR(VLOOKUP(P112,Hoja4!$A$254:$B$258,2,FALSE),0)","v":0},{"$f":"IFERROR(VLOOKUP(Q112,Hoja4!$A$254:$B$258,2,FALSE),0)","v":0},{"$f":"IFERROR(VLOOKUP(R112,Hoja4!$A$254:$B$258,2,FALSE),0)","v":0}]
[null,null,{"$f":"VLOOKUP(A114,Hoja1!$A$2:$C$28,2,FALSE)","v":{"$error":"#N/A"}},null,null,{"$f":"VLOOKUP(A114,Hoja1!$A$2:$C$28,3,FALSE)","v":{"$error":"#N/A"}},null,null,null,null,null,null,null,null,null,null,null,null,{"$f":"+M115*M$143+N115*N$143+O115*O$143+P115*P$143+Q115*Q$143+R115*R$143","v":0}]
[null,null,null,null,null,null,null,null,null,null,null,null,null,{"$f":"IFERROR(VLOOKUP(N114,Hoja4!$A$254:$B$258,2,FALSE),0)","v":0},{"$f":"IFERROR(VLOOKUP(O114,Hoja4!$A$254:$B$258,2,FALSE),0)","v":0},{"$f":"IFERROR(VLOOKUP(P114,Hoja4!$A$254:$B$258,2,FALSE),0)","v":0},{"$f":"IFERROR(VLOOKUP(Q114,Hoja4!$A$254:$B$258,2,FALSE),0)","v":0},{"$f":"IFERROR(VLOOKUP(R114,Hoja4!$A$254:$B$258,2,FALSE),0)","v":0}]
[null,null,{"$f":"VLOOKUP(A116,Hoja1!$A$2:$C$28,2,FALSE)","v":{"$error":"#N/A"}},null,null,{"$f":"VLOOKUP(A116,Hoja1!$A$2:$C$28,3,FALSE)","v":{"$error":"#N/A"}},null,null,null,null,null,null,null,null,null,null,null,null,{"$f":"+M117*M$143+N117*N$143+O117*O$143+P117*P$143+Q117*Q$143+R117*R$143","v":0}]
[null,null,null,null,null,null,null,null,null,null,null,null,null,{"$f":"IFERROR(VLOOKUP(N116,Hoja4!$A$254:$B$258,2,FALSE),0)","v":0},{"$f":"IFERROR(VLOOKUP(O116,Hoja4!$A$254:$B$258,2,FALSE),0)","v":0},{"$f":"IFERROR(VLOOKUP(P116,Hoja4!$A$254:$B$258,2,FALSE),0)","v":0},{"$f":"IFERROR(VLOOKUP(Q116,Hoja4!$A$254:$B$258,2,FALSE),0)","v":0},{"$f":"IFERROR(VLOOKUP(R116,Hoja4!$A$254:$B$258,2,FALSE),0)","v":0}]
[null,null,{"$f":"VLOOKUP(A118,Hoja1!$A$2:$C$28,2,FALSE)","v":{"$error":"#N/A"}},null,null,{"$f":"VLOOKUP(A118,Hoja1!$A$2:$C$28,3,FALSE)","v":{"$error":"#N/A"}},null,null,null,null,null,null,null,null,null,null,null,null,{"$f":"+M119*M$143+N119*N$143+O119*O$143+P119*P$143+Q119*Q$143+R119*R$143","v":0}]
[null,null,null,null,null,null,null,null,null,null,null,null,null,{"$f":"IFERROR(VLOOKUP(N118,Hoja4!$A$254:$B$258,2,FALSE),0)","v":0},{"$f":"IFERROR(VLOOKUP(O118,Hoja4!$A$254:$B$258,2,FALSE),0)","v":0},{"$f":"IFERROR(VLOOKUP(P118,Hoja4!$A$254:$B$258,2,FALSE),0)","v":0},{"$f":"IFERROR(VLOOKUP(Q118,Hoja4!$A$254:$B$258,2,FALSE),0)","v":0},{"$f":"IFERROR(VLOOKUP(R118,Hoja4!$A$254:$B$258,2,FALSE),0)","v":0}]
[null,null,{"$f":"VLOOKUP(A120,Hoja1!$A$2:$C$28,2,FALSE)","v":{"$error":"#N/A"}},null,null,{"$f":"VLOOKUP(A120,Hoja1!$A$2:$C$28,3,FALSE)","v":{"$error":"#N/A"}},null,null,null,null,null,null,null,null,null,null,null,null,{"$f":"+M121*M$143+N121*N$143+O121*O$143+P121*P$143+Q121*Q$143+R121*R$143","v":0}]
[null,null,null,null,null,null,null,null,null,null,null,null,null,{"$f":"IFERROR(VLOOKUP(N120,Hoja4!$A$254:$B$258,2,FALSE),0)","v":0},{"$f":"IFERROR(VLOOKUP(O120,Hoja4!$A$254:$B$258,2,FALSE),0)","v":0},{"$f":"IFERROR(VLOOKUP(P120,Hoja4!$A$254:$B$258,2,FALSE),0)","v":0},{"$f":"IFERROR(VLOOKUP(Q120,Hoja4!$A$254:$B$258,2,FALSE),0)","v":0},{"$f":"IFERROR(VLOOKUP(R120,Hoja4!$A$254:$B$258,2,FALSE),0)","v":0}]
[null,null,{"$f":"VLOOKUP(A122,Hoja1!$A$2:$C$28,2,FALSE)","v":{"$error":"#N/A"}},null,null,{"$f":"VLOOKUP(A122,Hoja1!$A$2:$C$28,3,FALSE)","v":{"$error":"#N/A"}},null,null,null,null,null,null,null,null,null,null,null,null,{"$f":"+M123*M$143+N123*N$143+O123*O$143+P123*P$143+Q123*Q$143+R123*R$143","v":0}]
[null,null,null,null,null,null,null,null,null,null,null,null,null,{"$f":"IFERROR(VLOOKUP(N122,Hoja4!$A$254:$B$258,2,FALSE),0)","v":0},{"$f":"IFERROR(VLOOKUP(O122,Hoja4!$A$254:$B$258,2,FALSE),0)","v":0},{"$f":"IFERROR(VLOOKUP(P122,Hoja4!$A$254:$B$258,2,FALSE),0)","v":0},{"$f":"IFERROR(VLOOKUP(Q122,Hoja4!$A$254:$B$258,2,FALSE),0)","v":0},{"$f":"IFERROR(VLOOKUP(R122,Hoja4!$A$254:$B$258,2,FALSE),0)","v":0}]
[null,null,{"$f":"VLOOKUP(A124,Hoja1!$A$2:$C$28,2,FALSE)","v":{"$error":"#N/A"}},null,null,{"$f":"VLOOKUP(A124,Hoja1!$A$2:$C$28,3,FALSE)","v":{"$error":"#N/A"}},null,null,null,null,null,null,null,null,null,null,null,null,{"$f":"+M125*M$143+N125*N$143+O125*O$143+P125*P$143+Q125*Q$143+R125*R$143","v":0}]
[null,null,null,null,null,null,null,null,null,null,null,null,null,{"$f":"IFERROR(VLOOKUP(N124,Hoja4!$A$254:$B$258,2,FALSE),0)","v":0},{"$f":"IFERROR(VLOOKUP(O124,Hoja4!$A$254:$B$258,2,FALSE),0)","v":0},{"$f":"IFERROR(VLOOKUP(P124,Hoja4!$A$254:$B$258,2,FALSE),0)","v":0},{"$f":"IFERROR(VLOOKUP(Q124,Hoja4!$A$254:$B$258,2,FALSE),0)","v":0},{"$f":"IFERROR(VLOOKUP(R124,Hoja4!$A$254:$B$258,2,FALSE),0)","v":0}]
[null,null,{"$f":"VLOOKUP(A126,Hoja1!$A$2:$C$28,2,FALSE)","v":{"$error":"#N/A"}},null,null,{"$f":"VLOOKUP(A126,Hoja1!$A$2:$C$28,3,FALSE)","v":{"$error":"#N/A"}},null,null,null,null,null,null,null,null,null,null,null,null,{"$f":"+M127*M$143+N127*N$143+O127*O$143+P127*P$143+Q127*Q$143+R127*R$143","v":0}]
[null,null,null,null,null,null,null,null,null,null,null,null,null,{"$f":"IFERROR(VLOOKUP(N126,Hoja4!$A$254:$B$258,2,FALSE),0)","v":0},{"$f":"IFERROR(VLOOKUP(O126,Hoja4!$A$254:$B$258,2,FALSE),0)","v":0},{"$f":"IFERROR(VLOOKUP(P126,Hoja4!$A$254:$B$258,2,FALSE),0)","v":0},{"$f":"IFERROR(VLOOKUP(Q126,Hoja4!$A$254:$B$258,2,FALSE),0)","v":0},{"$f":"IFERROR(VLOOKUP(R126,Hoja4!$A$254:$B$258,2,FALSE),0)","v":0}]
[null,null,{"$f":"VLOOKUP(A128,Hoja1!$A$2:$C$28,2,FALSE)","v":{"$error":"#N/A"}},null,null,{"$f":"VLOOKUP(A128,Hoja1!$A$2:$C$28,3,FALSE)","v":{"$error":"#N/A"}},null,null,null,null,null,null,null,null,null,null,null,null,{"$f":"+M129*M$143+N129*N$143+O129*O$143+P129*P$143+Q129*Q$143+R129*R$143","v":0}]
[null,null,null,null,null,null,null,null,null,null,null,null,null,{"$f":"IFERROR(VLOOKUP(N128,Hoja4!$A$254:$B$258,2,FALSE),0)","v":0},{"$f":"IFERROR(VLOOKUP(O128,Hoja4!$A$254:$B$258,2,FALSE),0)","v":0},{"$f":"IFERROR(VLOOKUP(P128,Hoja4!$A$254:$B$258,2,FALSE),0)","v":0},{"$f":"IFERROR(VLOOKUP(Q128,Hoja4!$A$254:$B$258,2,FALSE),0)","v":0},{"$f":"IFERROR(VLOOKUP(R128,Hoja4!$A$254:$B$258,2,FALSE),0)","v":0}]
[null,null,{"$f":"VLOOKUP(A130,Hoja1!$A$2:$C$28,2,FALSE)","v":{"$error":"#N/A"}},null,null,{"$f":"VLOOKUP(A130,Hoja1!$A$2:$C$28,3,FALSE)","v":{"$error":"#N/A"}},null,null,null,null,null,null,null,null,null,null,null,null,{"$f":"+M131*M$143+N131*N$143+O131*O$143+P131*P$143+Q131*Q$143+R131*R$143","v":0}]
[null,null,null,null,null,null,null,null,null,null,null,null,null,{"$f":"IFERROR(VLOOKUP(N130,Hoja4!$A$254:$B$258,2,FALSE),0)","v":0},{"$f":"IFERROR(VLOOKUP(O130,Hoja4!$A$254:$B$258,2,FALSE),0)","v":0},{"$f":"IFERROR(VLOOKUP(P130,Hoja4!$A$254:$B$258,2,FALSE),0)","v":0},{"$f":"IFERROR(VLOOKUP(Q130,Hoja4!$A$254:$B$258,2,FALSE),0)","v":0},{"$f":"IFERROR(VLOOKUP(R130,Hoja4!$A$254:$B$258,2,FALSE),0)","v":0}]
[null,null,{"$f":"VLOOKUP(A132,Hoja1!$A$2:$C$28,2,FALSE)","v":{"$error":"#N/A"}},null,null,{"$f":"VLOOKUP(A132,Hoja1!$A$2:$C$28,3,FALSE)","v":{"$error":"#N/A"}},null,null,null,null,null,null,null,null,null,null,null,null,{"$f":"+M133*M$143+N133*N$143+O133*O$143+P133*P$143+Q133*Q$143+R133*R$143","v":0}]
[null,null,null,null,null,null,null,null,null,null,null,null,null,{"$f":"IFERROR(VLOOKUP(N132,Hoja4!$A$254:$B$258,2,FALSE),0)","v":0},{"$f":"IFERROR(VLOOKUP(O132,Hoja4!$A$254:$B$258,2,FALSE),0)","v":0},{"$f":"IFERROR(VLOOKUP(P132,Hoja4!$A$254:$B$258,2,FALSE),0)","v":0},{"$f":"IFERROR(VLOOKUP(Q132,Hoja4!$A$254:$B$258,2,FALSE),0)","v":0},{"$f":"IFERROR(VLOOKUP(R132,Hoja4!$A$254:$B$258,2,FALSE),0)","v":0}]
[null,null,{"$f":"VLOOKUP(A134,Hoja1!$A$2:$C$28,2,FALSE)","v":{"$error":"#N/A"}},null,null,{"$f":"VLOOKUP(A134,Hoja1!$A$2:$C$28,3,FALSE)","v":{"$error":"#N/A"}},null,null,null,null,null,null,null,null,null,null,null,null,{"$f":"+M135*M$143+N135*N$143+O135*O$143+P135*P$143+Q135*Q$143+R135*R$143","v":0}]
[null,null,null,null,null,null,null,null,null,null,null,null,null,{"$f":"IFERROR(VLOOKUP(N134,Hoja4!$A$254:$B$258,2,FALSE),0)","v":0},{"$f":"IFERROR(VLOOKUP(O134,Hoja4!$A$254:$B$258,2,FALSE),0)","v":0},{"$f":"IFERROR(VLOOKUP(P134,Hoja4!$A$254:$B$258,2,FALSE),0)","v":0},{"$f":"IFERROR(VLOOKUP(Q134,Hoja4!$A$254:$B$258,2,FALSE),0)","v":0},{"$f":"IFERROR(VLOOKUP(R134,Hoja4!$A$254:$B$258,2,FALSE),0)","v":0}]
[null,null,{"$f":"VLOOKUP(A136,Hoja1!$A$2:$C$28,2,FALSE)","v":{"$error":"#N/A"}},null,null,{"$f":"VLOOKUP(A136,Hoja1!$A$2:$C$28,3,FALSE)","v":{"$error":"#N/A"}},null,null,null,null,null,null,null,null,null,null,null,null,{"$f":"+M137*M$143+N137*N$143+O137*O$143+P137*P$143+Q137*Q$143+R137*R$143","v":0}]
[null,null,null,null,null,null,null,null,null,null,null,null,null,{"$f":"IFERROR(VLOOKUP(N136,Hoja4!$A$254:$B$258,2,FALSE),0)","v":0},{"$f":"IFERROR(VLOOKUP(O136,Hoja4!$A$254:$B$258,2,FALSE),0)","v":0},{"$f":"IFERROR(VLOOKUP(P136,Hoja4!$A$254:$B$258,2,FALSE),0)","v":0},{"$f":"IFERROR(VLOOKUP(Q136,Hoja4!$A$254:$B$258,2,FALSE),0)","v":0},{"$f":"IFERROR(VLOOKUP(R136,Hoja4!$A$254:$B$258,2,FALSE),0)","v":0}]
[null,null,{"$f":"VLOOKUP(A138,Hoja1!$A$2:$C$28,2,FALSE)","v":{"$error":"#N/A"}},null,null,{"$f":"VLOOKUP(A138,Hoja1!$A$2:$C$28,3,FALSE)","v":{"$error":"#N/A"}},null,null,null,null,null,null,null,null,null,null,null,null,{"$f":"+M139*M$143+N139*N$143+O139*O$143+P139*P$143+Q139*Q$143+R139*R$143","v":0}]
[null,null,null,null,null,null,null,null,null,null,null,null,null,{"$f":"IFERROR(VLOOKUP(N138,Hoja4!$A$254:$B$258,2,FALSE),0)","v":0},{"$f":"IFERROR(VLOOKUP(O138,Hoja4!$A$254:$B$258,2,FALSE),0)","v":0},{"$f":"IFERROR(VLOOKUP(P138,Hoja4!$A$254:$B$258,2,FALSE),0)","v":0},{"$f":"IFERROR(VLOOKUP(Q138,Hoja4!$A$254:$B$258,2,FALSE),0)","v":0},{"$f":"IFERROR(VLOOKUP(R138,Hoja4!$A$254:$B$258,2,FALSE),0)","v":0}]
[null,null,{"$f":"VLOOKUP(A140,Hoja1!$A$2:$C$28,2,FALSE)","v":{"$error":"#N/A"}},null,null,{"$f":"VLOOKUP(A140,Hoja1!$A$2:$C$28,3,FALSE)","v":{"$error":"#N/A"}},null,null,null,null,null,null,null,null,null,null,null,null,{"$f":"+M141*M$143+N141*N$143+O141*O$143+P141*P$143+Q141*Q$143+R141*R$143","v":0}]
[null,null,null,null,null,null,null,null,null,null,null,null,null,{"$f":"IFERROR(VLOOKUP(N140,Hoja4!$A$254:$B$258,2,FALSE),0)","v":0},{"$f":"IFERROR(VLOOKUP(O140,Hoja4!$A$254:$B$258,2,FALSE),0)","v":0},{"$f":"IFERROR(VLOOKUP(P140,Hoja4!$A$254:$B$258,2,FALSE),0)","v":0},{"$f":"IFERROR(VLOOKUP(Q140,Hoja4!$A$254:$B$258,2,FALSE),0)","v":0},{"$f":"IFERROR(VLOOKUP(R140,Hoja4!$A$254:$B$258,2,FALSE),0)","v":0}]
["PONDERACIÓN POR EVALUACIÓN EVENTUAL",null,null,null,null,null,null,null,null,null,null,null,null,{"$f":"IFERROR(AVERAGEIF(N92:N141,\">0\",N92:N141),0)","v":0},{"$f":"IFERROR(AVERAGEIF(O92:O141,\">0\",O92:O141),0)","v":0},0,0,0]
["% Participación Días Laborados de cada Evaluación Eventual",null,null,null,null,null,null,null,null,null,null,null,null,{"$f":"+N87","v":0},0,0,0,0]
["CALIFICACIÓN TOTAL COMPETENCIAS COMPORTAMENTALES",null,null,null,null,null,null,null,null,null,null,null,{"$f":"SUM(IF(N143>0,N142*N143,0),IF(O143>0,O143*O142,0),IF(P143>0,P143*P142,0),IF(Q143>0,Q143*Q142,0),IF(R143>0,R143*R142,0))","v":0}]

{"sheet":"F1. INF. GENERAL","index":2,"n_rows":46,"n_cols":19,"rows_kept":46,"cut":false,"hidden":false,"merged":[[6,9,6,10],[6,11,6,12],[6,13,6,14],[7,0,7,14],[8,0,9,3],[8,7,9,8],[8,12,9,15],[1,0,6,3],[1,4,2,14],[1,15,7,18],[3,4,4,14],[5,4,6,6],[5,7,5,8],[5,9,5,10],[5,11,5,12],[5,13,5,14],[6,7,6,8],[12,0,12,1],[12,2,12,4],[12,5,12,7],[12,8,12,10],[12,11,12,14],[12,15,12,18],[10,0,10,18],[11,0,11,1],[11,2,11,4],[11,5,11,7],[11,8,11,10],[11,11,11,14],[11,15,11,18],[13,0,13,7],[13,8,13,18],[14,0,14,7],[14,8,14,18],[15,0,15,4],[15,5,15,6],[15,8,16,8],[15,9,16,18],[16,0,16,4],[16,5,16,6],[19,0,19,1],[19,2,19,4],[19,5,19,7],[19,8,19,10],[19,11,19,14],[19,15,19,18],[17,0,17,18],[18,0,18,1],[18,2,18,4],[18,5,18,7],[18,8,18,10],[18,11,18,14],[18,15,18,18],[20,0,20,5],[20,6,20,12],[20,13,20,14],[20,15,20,16],[20,17,20,18],[21,0,21,5],[21,6,21,12],[21,13,21,14],[21,15,21,16],[21,17,21,18],[24,0,24,1],[24,2,24,4],[24,5,24,7],[24,8,24,10],[24,11,24,14],[24,15,24,18],[22,0,22,18],[23,0,23,1],[23,2,23,4],[23,5,23,7],[23,8,23,10],[23,11,23,14],[23,15,23,18],[25,0,25,5],[25,6,25,12],[25,13,25,14],[25,15,25,16],[25,17,25,18],[26,0,26,5],[26,6,26,12],[26,13,26,14],[26,15,26,16],[26,17,26,18],[27,0,27,18],[28,0,31,3],[28,4,31,8],[28,9,31,9],[28,10,31,10],[28,11,29,18],[30,11,30,14],[30,15,30,18],[31,13,31,14],[31,17,31,18],[34,11,34,14],[34,15,34,18],[35,11,35,14],[35,15,35,18],[33,0,33,8],[33,11,33,13],[33,15,33,17],[32,13,32,14],[32,17,32,18],[32,0,32,3],[32,4,32,8],[37,11,37,18],[38,11,38,14],[38,15,38,18],[39,0,40,10],[39,11,40,13],[39,14,40,14],[39,15,40,17],[39,18,40,18],[36,0,36,10],[36,11,36,14],[36,15,36,18],[43,0,44,0],[43,1,44,4],[43,5,44,6],[43,7,44,8],[41,9,45,10],[34,0,35,4],[34,5,34,9],[35,5,35,10],[46,13,46,18],[45,15,45,18],[45,0,45,4],[45,5,45,8],[44,11,44,14],[44,15,44,18],[45,11,45,14],[43,11,43,18],[41,0,41,8],[41,11,41,18],[42,0,42,4],[42,5,42,6],[42,7,42,8],[42,11,42,14],[42,15,42,18],[37,0,38,10]]}
[]
[null,null,null,null,"COMISIÓN NACIONAL DEL SERVICIO CIVIL"]
[]
[null,null,null,null,"FORMATO 1. INFORMACIÓN GENERAL - CONSOLIDADOR"]
[]
[null,null,null,null,"PROCESO: EVALUACIÓN DEL DESEMPEÑO LABORAL",null,null,"Código:  ",null,"F-ED-002",null,"Página",null,"1 de 1"]
[null,null,null,null,null,null,null,"Fecha de emisión: ",null,"2016-12-27",null,"Versión: ",null,"2.0"]
[]
["PERÍODO DE EVALUACIÓN",null,null,null,"DÍA","MES","AÑO","al",null,"DÍA","MES","AÑO","FECHA CONCERTACIÓN O AJUSTE DE COMPROMISOS",null,null,null,"DÍA","MES","AÑO"]
[]
[]
["Tipo de Documento",null,"Número de identificación",null,null,"Primer apellido",null,null,"Segundo apellido",null,null,"Primer nombre",null,null,null,"Otros nombres"]
[{"$f":"CONSOLIDADOR!A12","v":"Cédula de ciudadanía"},null,null,null,null,null,null,null,{"$f":"IF(CONSOLIDADOR!I12=\"\",\"\",CONSOLIDADOR!I12)","v":""},null,null,{"$f":"IF(CONSOLIDADOR!L12=\"\",\"\",CONSOLIDADOR!L12)","v":""},null,null,null,{"$f":"IF(CONSOLIDADOR!P12=\"\",\"\",CONSOLIDADOR!P12)","v":""}]
["Dependencia o área a la que pertenece el evaluado",null,null,null,null,null,null,null,"Denominación del empleo"]
[{"$f":"IF(CONSOLIDADOR!A14=\"\",\"\",CONSOLIDADOR!A14)","v":""},null,null,null,null,null,null,null,{"$f":"IF(CONSOLIDADOR!I14=\"\",\"\",CONSOLIDADOR!I14)","v":""}]
["Nivel jerárquico",null,null,null,null,"Código",null,"Grado",{"$f":"'[3]F2. COMP. LAB Y COM COMPOR'!I16:S17","v":"Propósito del empleo:"},{"$f":"IF(CONSOLIDADOR!K15=\"\",\"\",CONSOLIDADOR!K15)","v":""}]
[{"$f":"IF(CONSOLIDADOR!A16=\"\",\"\",CONSOLIDADOR!A16)","v":""},null,null,null,null,{"$f":"IF(CONSOLIDADOR!F16=\"\",\"\",CONSOLIDADOR!F16)","v":""},null,{"$f":"IF(CONSOLIDADOR!H16=\"\",\"\",CONSOLIDADOR!H16)","v":""}]
["II. IDENTIFICACIÓN EVALUADOR. (Jefe inmediato)"]
["Tipo de documento",null,"Número de identificación",null,null,"Primer apellido",null,null,"Segundo apellido",null,null,"Primer nombre",null,null,null,"Otros nombres"]
[{"$f":"CONSOLIDADOR!A19","v":"Cédula de ciudadanía"},null,{"$f":"IF(CONSOLIDADOR!C19=\"\",\"\",CONSOLIDADOR!C19)","v":""},null,null,{"$f":"IF(CONSOLIDADOR!F19=\"\",\"\",CONSOLIDADOR!F19)","v":""},null,null,{"$f":"IF(CONSOLIDADOR!I19=\"\",\"\",CONSOLIDADOR!I19)","v":""},null,null,{"$f":"IF(CONSOLIDADOR!L19=\"\",\"\",CONSOLIDADOR!L19)","v":""},null,null,null,{"$f":"IF(CONSOLIDADOR!P19=\"\",\"\",CONSOLIDADOR!P19)","v":""}]
[" Área o Dependencia a la que pertenece el evaluador",null,null,null,null,null,"Denominación del empleo",null,null,null,null,null,null,"Código",null,"Grado",null,"Nivel jerárquico"]
[{"$f":"IF(CONSOLIDADOR!A21=\"\",\"\",CONSOLIDADOR!A21)","v":""},null,null,null,null,null,{"$f":"IF(CONSOLIDADOR!G21=\"\",\"\",CONSOLIDADOR!G21)","v":""},null,null,null,null,null,null,{"$f":"IF(CONSOLIDADOR!N21=\"\",\"\",CONSOLIDADOR!N21)","v":""},null,{"$f":"IF(CONSOLIDADOR!P21=\"\",\"\",CONSOLIDADOR!P21)","v":""},null,{"$f":"IF(CONSOLIDADOR!R21=\"\",\"\",CONSOLIDADOR!R21)","v":""}]
["III. IDENTIFICACIÓN EVALUADOR (Servidor público de Libre Nombramiento y Remoción en caso de constituir Comisión Evaluadora)"]
["Tipo de documento",null,"Número de identificación",null,null,"Primer apellido",null,null,"Segundo apellido",null,null,"Primer nombre",null,null,null,"Otros nombres"]
[{"$f":"CONSOLIDADOR!A24","v":"Cédula de ciudadanía"},null,{"$f":"IF(CONSOLIDADOR!S22=\"NO\",\"NO REQUIERE\",IF(CONSOLIDADOR!C24=\"\",\"\",CONSOLIDADOR!C24))","v":"NO REQUIERE"},null,null,{"$f":"IF(CONSOLIDADOR!S22=\"NO\",\"NO REQUIERE\",IF(CONSOLIDADOR!F24=\"\",\"\",CONSOLIDADOR!F24))","v":"NO REQUIERE"},null,null,{"$f":"IF(CONSOLIDADOR!S22=\"NO\",\"NO REQUIERE\",IF(CONSOLIDADOR!I24=\"\",\"\",CONSOLIDADOR!I24))","v":"NO REQUIERE"},null,null,{"$f":"IF(CONSOLIDADOR!S22=\"NO\",\"NO REQUIERE\",IF(CONSOLIDADOR!L24=\"\",\"\",CONSOLIDADOR!L24))","v":"NO REQUIERE"},null,null,null,{"$f":"IF(CONSOLIDADOR!S22=\"NO\",\"NO REQUIERE\",IF(CONSOLIDADOR!P24=\"\",\"\",CONSOLIDADOR!P24))","v":"NO REQUIERE"}]
["Dependencia o área a la que pertenece el evaluador",null,null,null,null,null,"Denominación del empleo",null,null,null,null,null,null,"Código",null,"Grado",null,"Nivel jerárquico"]
[{"$f":"IF(CONSOLIDADOR!S22=\"NO\",\"NO REQUIERE\",IF(CONSOLIDADOR!A26=\"\",\"\",CONSOLIDADOR!A26))","v":"NO REQUIERE"},null,null,null,null,null,{"$f":"IF(CONSOLIDADOR!S22=\"NO\",\"NO REQUIERE\",IF(CONSOLIDADOR!G26=\"\",\"\",CONSOLIDADOR!G26))","v":"NO REQUIERE"},null,null,null,null,null,null,{"$f":"IF(CONSOLIDADOR!S22=\"NO\",\"NO REQUIERE\",IF(CONSOLIDADOR!N26=\"\",\"\",CONSOLIDADOR!N26))","v":"NO REQUIERE"},null,{"$f":"IF(CONSOLIDADOR!S22=\"NO\",\"NO REQUIERE\",IF(CONSOLIDADOR!P26=\"\",\"\",CONSOLIDADOR!P26))","v":"NO REQUIERE"},null,{"$f":"IF(CONSOLIDADOR!S22=\"NO\",\"NO REQUIERE\",IF(CONSOLIDADOR!R26=\"\",\"\",CONSOLIDADOR!R26))","v":"NO REQUIERE"}]
["IV. COMPROMISOS LABORALES"]
["Metas de la Dependencia a las cuales contribuye el empleo",null,null,null,"Compromisos Laborales.",null,null,null,null,"Peso porcentual del compromiso en el año","Calificación por compromiso en período anual","Porcentaje de Cumplimiento. "]
[]
[null,null,null,null,null,null,null,null,null,null,null,"PRIMERA PARCIAL SEMESTRAL",null,null,null,"SEGUNDA PARCIAL SEMESTRAL"]
[null,null,null,null,null,null,null,null,null,null,null,"Peso porcentual semestre","CALIFICACIÓN DEL COMPROMISO","CALIFICACIÓN DEL COMPROMISO (Con peso porcentual)",null,"Peso porcentual semestre","CALIFICACIÓN DEL COMPROMISO","CALIFICACIÓN DEL COMPROMISO (Con peso porcentual)"]
["Ver hoja de consolidación",null,null,null,"Ver hoja de consolidación",null,null,null,null,1,"Ver hoja de consolidación",1,null,{"$f":"(L33*M33)","v":0},null,1,null,{"$f":"(P33*Q33)","v":0}]
[" TOTALES",null,null,null,null,null,null,null,null,{"$f":"SUM(J33:J33)","v":1},"Ver hoja de consolidación","Resultado total ",null,null,{"$f":"SUMIF(N33:O33,\"<=100\",N33:O33)","v":0},"Resultado total ",null,null,{"$f":"SUMIF(R33:S33,\"<=100\",R33:S33)","v":0}]
["Tiempo efectivamente laborado en el semestre",null,null,null,null,"Total Días Laborados de cada Evaluación Semestral",null,null,null,null,{"$f":"+L35+P35","v":0}]
[null,null,null,null,null,"% Participación Días Laborados de cada Evaluación Semestral",null,null,null,null,null,{"$f":"IFERROR('Hoja4 (2)'!D539,0)","v":0},null,null,null,{"$f":"IFERROR('Hoja4 (2)'!D540,0)","v":0}]
["TOTAL SEMESTRAL",null,null,null,null,null,null,null,null,null,null,{"$f":"IFERROR(O34*L36,\"No Aplica\")","v":0},null,null,null,{"$f":"IFERROR(S34*P36,\"No Aplica\")","v":0}]
["Calificaciones parciales semestrales compromisos laborales ",null,null,null,null,null,null,null,null,null,null,"Calificación total"]
[null,null,null,null,null,null,null,null,null,null,null,{"$f":"O34*40","v":0},null,null,null,{"$f":"S34*40","v":0}]
["CALIFICACIÒN TOTAL DE LOS COMPROMISOS LABORALES",null,null,null,null,null,null,null,null,null,null,"Sobre el 100%",null,null,{"$f":"IF(AND(L36>0,P36>0)=TRUE,((O34*L36)+(S34*P36)),\"No Aplica\")","v":"No Aplica"},"Sobre el peso porcentual del 80%",null,null,{"$f":"IF(O40=\"No Aplica\",\"No Aplica\",(O40*80%))","v":"No Aplica"}]
[]
["V. COMPETENCIAS COMPORTAMENTALES",null,null,null,null,null,null,null,null,"CONSOLIDADOR",null,"VI. EVALUACIÓN DE GESTIÓN POR ÁREAS O DEPENDENCIAS"]
["COMPETENCIAS COMPORTAMENTALES",null,null,null,null,"1° parcial semestral",null,"2° parcial semestral",null,null,null,"CALIFICACIÓN DE LA EVALUACIÓN DE GESTIÓN POR ÁREAS O  DEPENDENCIAS."]
[1,"Ver hoja de consolidación",null,null,null,null,null,null,null,null,null,"VII. RESULTADOS CONSOLIDADOS COMPONENTES DE LA EVALUACIÓN DE DESEMPEÑO LABORAL PARA LA EVALUACIÓN ANUAL U ORDINARIA"]
[null,null,null,null,null,null,null,null,null,null,null,"CALIFICACIÓN",null,null,null,"NIVEL DE CALIFICACIÓN"]
["CALIFICACIÓN DE LAS COMPETENCIAS COMPORTAMENTALES",null,null,null,null,{"$f":"(F44*L36)+(H44*P36)","v":0},null,null,null,null,null,{"$f":"IFERROR((S40+F46+P43),\"NO APLICA\")","v":"NO APLICA"},null,null,null,{"$f":"IF(L46=\"NO APLICA\",\"NO APLICA\",IFERROR(VLOOKUP(L46,Hoja4!AA3:AB1002,2),\"NO APLICA\"))","v":"NO APLICA"}]

{"sheet":"F6. REPOR CLF PRD ANUAL U ORD","index":3,"n_rows":89,"n_cols":18,"rows_kept":89,"cut":false,"hidden":false,"merged":[[11,0,11,1],[11,2,11,4],[11,5,11,7],[11,8,11,10],[11,11,11,14],[11,15,11,18],[8,9,8,13],[8,14,8,15],[9,0,9,18],[10,0,10,1],[10,2,10,4],[10,5,10,7],[10,8,10,10],[10,11,10,14],[10,15,10,18],[1,0,8,2],[1,3,2,15],[1,16,8,18],[3,3,4,15],[5,3,8,8],[5,9,5,11],[5,12,5,13],[5,14,5,15],[6,9,7,13],[6,14,7,15],[18,0,18,1],[18,2,18,4],[18,5,18,7],[18,8,18,10],[18,11,18,14],[18,15,18,18],[16,0,16,18],[17,0,17,1],[17,2,17,4],[17,5,17,7],[17,8,17,10],[17,11,17,14],[17,15,17,18],[12,0,12,7],[12,8,12,18],[13,0,13,7],[13,8,13,18],[14,0,14,4],[14,5,14,6],[14,8,15,10],[14,11,15,18],[15,0,15,4],[15,5,15,6],[19,0,19,5],[19,6,19,12],[19,13,19,14],[19,15,19,16],[19,17,19,18],[20,0,20,5],[20,6,20,12],[20,13,20,14],[20,15,20,16],[20,17,20,18],[23,0,23,1],[23,2,23,4],[23,5,23,7],[23,8,23,10],[23,11,23,14],[23,15,23,18],[21,0,21,18],[22,0,22,1],[22,2,22,4],[22,5,22,7],[22,8,22,10],[22,11,22,14],[22,15,22,18],[24,0,24,5],[24,6,24,12],[24,13,24,14],[24,15,24,16],[24,17,24,18],[25,0,25,5],[25,6,25,12],[25,13,25,14],[25,15,25,16],[25,17,25,18],[26,0,26,18],[27,0,27,4],[27,5,27,10],[27,11,29,12],[27,13,27,18],[28,0,29,1],[28,2,29,4],[28,5,29,10],[28,13,29,14],[28,15,29,16],[32,2,32,3],[32,5,32,9],[33,0,34,1],[33,2,34,4],[33,6,34,10],[33,13,34,14],[28,17,29,18],[30,0,32,1],[30,2,30,3],[30,5,30,9],[30,11,32,12],[30,13,32,14],[30,15,32,16],[30,17,32,18],[31,2,31,3],[31,5,31,9],[35,19,36,19],[37,0,38,1],[37,2,38,4],[37,6,38,10],[37,11,38,18],[37,19,38,19],[33,15,34,18],[35,0,36,1],[35,2,36,4],[35,6,36,10],[35,13,36,14],[35,15,36,18],[44,16,44,18],[45,6,45,8],[45,16,45,18],[46,0,47,1],[46,2,47,8],[46,9,47,11],[46,12,47,18],[39,0,39,18],[40,0,41,18],[42,0,42,18],[43,0,43,8],[43,9,43,18],[44,0,45,2],[44,3,45,5],[44,6,44,8],[44,9,45,12],[44,13,45,15],[53,0,55,3],[53,4,55,8],[53,9,55,13],[53,14,55,18],[56,0,56,8],[56,9,56,18],[48,0,50,3],[48,9,50,13],[48,14,50,18],[51,0,52,3],[51,4,52,8],[51,9,52,13],[51,14,52,18],[62,0,62,18],[67,9,67,15],[67,16,67,17],[68,9,68,15],[68,16,68,17],[69,9,69,15],[69,16,69,17],[57,0,57,8],[57,9,57,18],[58,0,58,18],[59,0,61,2],[59,3,61,3],[59,4,61,6],[59,7,61,10],[59,11,61,14],[59,15,61,18],[83,16,83,17],[75,9,76,15],[75,16,76,17],[77,9,78,15],[77,16,78,17],[79,9,80,15],[79,16,80,17],[70,9,70,15],[70,16,70,17],[71,9,72,15],[71,16,72,17],[73,9,74,15],[73,16,74,17]]}
[]
[null,null,null,"COMISIÓN NACIONAL DEL SERVICIO CIVIL \n    ",null,null,null,null,null,null,null,null,null,null,null,null,"INSERTE EL LOGOTIPO DE SU ENTIDAD"]
[]
[null,null,null,"FORMATO 6. REPORTE DE CALIFICACIÓN PERÍODO ANUAL U ORDINARIO"]
[]
[null,null,null,"PROCESO: EVALUACIÓN DEL DESEMPEÑO LABORAL",null,null,null,null,null,"CÓDIGO:  ",null,null,"F-ED-007",null,"Página: 1 de 1"]
[null,null,null,null,null,null,null,null,null,"FECHA EMISIÓN",null,null,null,null,"2016-12-27"]
[]
[null,null,null,null,null,null,null,null,null,"Versión ",null,null,null,null,"2.0"]
["I. IDENTIFICACIÓN DEL EVALUADO"]
["Tipo de Documento",null,"Número de identificación",null,null,"Primer apellido",null,null,"Segundo apellido",null,null,"Primer nombre",null,null,null,"Otros nombres"]
[{"$f":"+'F1. INF. GENERAL'!A13","v":"Cédula de ciudadanía"},null,{"$f":"+'F1. INF. GENERAL'!C13","v":0},null,null,{"$f":"+'F1. INF. GENERAL'!F13","v":0},null,null,{"$f":"+'F1. INF. GENERAL'!I13","v":""},null,null,{"$f":"+'F1. INF. GENERAL'!L13","v":""},null,null,null,{"$f":"+'F1. INF. GENERAL'!P13","v":""}]
["Dependencia o área a la que pertenece el evaluado",null,null,null,null,null,null,null,"Denominación del empleo"]
[{"$f":"+'F1. INF. GENERAL'!A15","v":""},null,null,null,null,null,null,null,{"$f":"+'F1. INF. GENERAL'!I15","v":""}]
["Nivel jerárquico",null,null,null,null,"Código",null,"Grado",{"$f":"'F1. INF. GENERAL'!I16","v":"Propósito del empleo:"},null,null,{"$f":"+'F1. INF. GENERAL'!J16","v":""}]
[{"$f":"+'F1. INF. GENERAL'!A17","v":""},null,null,null,null,{"$f":"+'F1. INF. GENERAL'!F17","v":""},null,{"$f":"+'F1. INF. GENERAL'!H17","v":""}]
["II. IDENTIFICACIÓN EVALUADOR. (Jefe inmediato)"]
["Tipo de documento",null,"Número de identificación",null,null,"Primer apellido",null,null,"Segundo apellido",null,null,"Primer nombre",null,null,null,"Otros nombres"]
[{"$f":"+'F1. INF. GENERAL'!A20","v":"Cédula de ciudadanía"},null,{"$f":"+'F1. INF. GENERAL'!C20","v":""},null,null,{"$f":"+'F1. INF. GENERAL'!F20","v":""},null,null,{"$f":"+'F1. INF. GENERAL'!I20","v":""},null,null,{"$f":"+'F1. INF. GENERAL'!L20","v":""},null,null,null,{"$f":"+'F1. INF. GENERAL'!P20","v":""}]
[" Área o Dependencia a la que pertenece el evaluador",null,null,null,null,null,"Denominación del empleo",null,null,null,null,null,null,"Código",null,"Grado",null,"Nivel jerárquico"]
[{"$f":"+'F1. INF. GENERAL'!A22","v":""},null,null,null,null,null,{"$f":"+'F1. INF. GENERAL'!G22","v":""},null,null,null,null,null,null,{"$f":"+'F1. INF. GENERAL'!N22","v":""},null,{"$f":"+'F1. INF. GENERAL'!P22","v":""},null,{"$f":"+'F1. INF. GENERAL'!R22","v":""}]
["III. IDENTIFICACIÓN EVALUADOR (Servidor público de Libre Nombramiento y Remoción en caso de constituir Comisión Evaluadora)"]
["Tipo de documento",null,"Número de identificación",null,null,"Primer apellido",null,null,"Segundo apellido",null,null,"Primer nombre",null,null,null,"Otros nombres"]
[{"$f":"+'F1. INF. GENERAL'!A25","v":"Cédula de ciudadanía"},null,{"$f":"+'F1. INF. GENERAL'!C25","v":"NO REQUIERE"},null,null,{"$f":"+'F1. INF. GENERAL'!F25","v":"NO REQUIERE"},null,null,{"$f":"+'F1. INF. GENERAL'!I25","v":"NO REQUIERE"},null,null,{"$f":"+'F1. INF. GENERAL'!L25","v":"NO REQUIERE"},null,null,null,{"$f":"+'F1. INF. GENERAL'!P25","v":"NO REQUIERE"}]
["Dependencia o área a la que pertenece el evaluador",null,null,null,null,null,"Denominación del empleo",null,null,null,null,null,null,"Código",null,"Grado",null,"Nivel jerárquico"]
[{"$f":"+'F1. INF. GENERAL'!A27","v":"NO REQUIERE"},null,null,null,null,null,{"$f":"+'F1. INF. GENERAL'!G27","v":"NO REQUIERE"},null,null,null,null,null,null,{"$f":"+'F1. INF. GENERAL'!N27","v":"NO REQUIERE"},null,{"$f":"+'F1. INF. GENERAL'!P27","v":"NO REQUIERE"},null,{"$f":"+'F1. INF. GENERAL'!R27","v":"NO REQUIERE"}]
["IV. CONSOLIDACIÓN DE LAS EVALUACIONES"]
["EVALUACIÓN INDIVIDUAL DEL PRIMER SEMESTRE ",null,null,null,null,"EVALUACIÓN INDIVIDUAL DEL SEGUNDO SEMESTRE",null,null,null,null,null,"EVALUACIÓN DE GESTIÓN POR ÁREAS O DEPENDENCIAS (/10)",null,"CALIFICACIÓN DEFINITIVA"]
["FECHA DE COMUNICACIÓN",null,"CALIFICACIÓN PRIMER SEMESTRE\n",null,null,"CALIFICACIÓN SEGUNDO SEMESTRE\n",null,null,null,null,null,null,null,"FECHA DE NOTIFICACIÓN",null,"CALIFICACIÓN DEFINITIVA\n",null,"NIVEL"]
[]
[null,null,"Tiempo efectivamente laborado",null,{"$f":"CONCATENATE(IF('F1. INF. GENERAL'!L35=\"\",0,'F1. INF. GENERAL'!L35),\" días\")","v":"0 días"},"Tiempo efectivamente laborado",null,null,null,null,{"$f":"CONCATENATE(IF('F1. INF. GENERAL'!P35=\"\",0,'F1. INF. GENERAL'!P35),\" días\")","v":"0 días"},null,null,null,null,{"$f":"+'F1. INF. GENERAL'!L46","v":"NO APLICA"},null,{"$f":"+'F1. INF. GENERAL'!P46","v":"NO APLICA"}]
[null,null,"Compromisos laborales (sobre 100)",null,{"$f":"+'F1. INF. GENERAL'!O34","v":0},"Compromisos laborales (sobre 100)",null,null,null,null,{"$f":"+'F1. INF. GENERAL'!S34","v":0}]
[null,null,"Competencias comportamentales(/10)",null,{"$f":"+'F1. INF. GENERAL'!F44","v":0},"Competencias comportamentales(/10)",null,null,null,null,{"$f":"+'F1. INF. GENERAL'!H44","v":0}]
["Firma del  Evaluado",null,null,null,null,null,"Firma del  Evaluado",null,null,null,null,null,null,null,null," "]
[]
["Firma del Jefe Inmediato",null,null,null,null,null,"Firma del Jefe Inmediato"]
[]
["Firma del Evaluador en Comisión evaluadora",null,{"$f":"IF(C24=\"NO REQUERIDO\",\"NO APLICA\",\"\")","v":""},null,null,null,"Firma del Evaluador en Comisión evaluadora",null,null,null,null,{"$f":"IF(C24=\"NO REQUERIDO\",\"NO APLICA\",\"\")","v":""}]
[]
["INTERPONE RECURSOS"]
["SI"]
[]
["V. DECISIÓN DE RECURSOS"]
["RECURSO DE REPOSICIÓN",null,null,null,null,null,null,null,null,"RECURSO DE APELACIÓN"]
["DECISIÓN",null,null,null,null,null,"FECHA",null,null,"DECISIÓN",null,null,null,null,null,null,"FECHA"]
[]
["Nombre del Evaluado:",null,{"$f":"IF(D45=\"\",\"\",UPPER(CONCATENATE(L12,\" \",P12,\" \",F12,\" \",I12)))","v":""},null,null,null,null,null,null,"Nombre del Evaluado:",null,null,{"$f":"IF(N45=\"\",\"\",UPPER(CONCATENATE(L12,\" \",P12,\" \",F12,\" \",I12)))","v":""}]
[]
["Firma",null,null,null,null,null,null,null,null,"Firma"]
[]
[]
["Nombre del Notificador:",null,null,null,null,null,null,null,null,"Nombre del Notificador:"]
[]
["Firma",null,null,null,null,null,null,null,null,"Firma"]
[]
[]
["MOTIVACIÓN (podrá relacionar anexos):",null,null,null,null,null,null,null,null,"MOTIVACIÓN (podrá relacionar anexos):"]
[]
["VI. CALIFICACIÓN DEFINITIVA"]
["CALIFICACIÓN DEFINITIVA EN FIRME",null,null,null,"FIRMA Y NÚMERO DE CÉDULA DEL NOTIFICADO",null,null,null,null,null,null,"FIRMA Y NÚMERO DE CÉDULA DEL NOTIFICADOR"]
[]
[]
[]
[]
[]
[null,"SI",null,null,null,null,null,"CUMPLE"]
[null,"NO",null,null,null,null,null,"NO CUMPLE",null,"Contador de Cumplimiento"]
[null,null,null,null,null,null,null,"NO APLICA",null,"FACTORES DEL NIVEL SOBRESALIENTE",null,null,null,null,null,null,"CUMPLIMIENTO"]
["Cedula de ciudadanía",null,null,null,null,null,null,null,null,"Evaluación de la Gestión por Dependencias",null,null,null,null,null,null,{"$f":"IF(#REF!=\"Cumple\",1,0)","v":{"$error":"#REF!"}}]
["Cedula de extranjería",null,null,null,null,null,null,null,null,"Por calidad y oportunidad",null,null,null,null,null,null,{"$f":"IF(#REF!=\"Cumple\",1,0)","v":{"$error":"#REF!"}}]
[null,null,null,null,null,null,null,null,null,"Por aportes, propuestas o iniciativas adicionales",null,null,null,null,null,null,{"$f":"IF(#REF!=\"Cumple\",1,0)","v":{"$error":"#REF!"}}]
[null,null,null,null,null,null,null,null,null,"Por iniciativas tendientes a acciones proactivas en las actividades que cumplió",null,null,null,null,null,null,{"$f":"IF(#REF!=\"Cumple\",1,0)","v":{"$error":"#REF!"}}]
[]
[null,null,null,null,null,null,null,null,null,"Por participación y aprovechamiento de capacitación relacionada con las actividades propias del empleo y que genere un valor agregado para la entidad o la dependencia",null,null,null,null,null,null,{"$f":"IF(#REF!=\"Cumple\",1,0)","v":{"$error":"#REF!"}}]
[]
[null,null,null,null,null,null,null,null,null,"Por participación en grupos o en actividades que requieren de disposición voluntaria",null,null,null,null,null,null,{"$f":"IF(#REF!=\"Cumple\",1,0)","v":{"$error":"#REF!"}}]
[]
[null,null,null,null,null,null,null,null,null,null,null,null,null,null,null,null,{"$f":"IF(#REF!=\"Cumple\",1,0)","v":{"$error":"#REF!"}}]
[]
[null,null,null,null,null,null,null,null,null,null,null,null,null,null,null,null,{"$f":"IF(#REF!=\"Cumple\",1,0)","v":{"$error":"#REF!"}}]
[]
[]
[]
[null,null,null,null,null,null,null,null,null,null,null,null,null,null,null,null,{"$f":"SUM(Q69:R81)","v":{"$error":"#REF!"}}]
[]
[]
[null,null,null,null,null,null,null,null,null,null,null,null,null,null,null,null,"CRITERIO DE ORIENTACIÓN"]
[null,null,null,null,null,null,null,null,null,null,null,null,null,null,null,null,"CUMPLE"]
[null,null,null,null,null,null,null,null,null,null,null,null,null,null,null,null,"NO CUMPLE"]

{"sheet":"F9. EV. EXTRAORDINARIA","index":4,"n_rows":186,"n_cols":19,"rows_kept":186,"cut":false,"hidden":false,"merged":[[6,9,6,10],[6,11,6,12],[6,13,6,14],[7,0,8,3],[7,7,8,8],[7,12,8,15],[1,0,6,3],[1,4,2,14],[1,15,6,18],[3,4,4,14],[5,4,6,6],[5,7,5,8],[5,9,5,10],[5,11,5,12],[5,13,5,14],[6,7,6,8],[11,0,11,1],[11,2,11,4],[11,5,11,7],[11,8,11,10],[11,11,11,14],[11,15,11,18],[9,0,9,18],[10,0,10,1],[10,2,10,4],[10,5,10,7],[10,8,10,10],[10,11,10,14],[10,15,10,18],[12,0,12,7],[12,8,12,18],[13,0,13,7],[13,8,13,18],[14,0,14,4],[14,5,14,6],[14,8,15,9],[14,10,15,18],[15,0,15,4],[15,5,15,6],[18,0,18,1],[18,2,18,4],[18,5,18,7],[18,8,18,10],[18,11,18,14],[18,15,18,18],[16,0,16,18],[17,0,17,1],[17,2,17,4],[17,5,17,7],[17,8,17,10],[17,11,17,14],[17,15,17,18],[19,0,19,5],[19,6,19,12],[19,13,19,14],[19,15,19,16],[19,17,19,18],[20,0,20,5],[20,6,20,12],[20,13,20,14],[20,15,20,16],[20,17,20,18],[23,0,23,1],[23,2,23,4],[23,5,23,7],[23,8,23,10],[23,11,23,14],[23,15,23,18],[21,0,21,18],[22,0,22,1],[22,2,22,4],[22,5,22,7],[22,8,22,10],[22,11,22,14],[22,15,22,18],[24,0,24,5],[24,6,24,12],[24,13,24,14],[24,15,24,16],[24,17,24,18],[25,0,25,5],[25,6,25,12],[25,13,25,14],[25,15,25,16],[25,17,25,18],[31,17,31,18],[31,0,31,3],[31,4,31,8],[31,9,31,10],[31,13,31,14],[26,0,26,18],[27,0,30,3],[27,4,30,8],[27,9,30,10],[27,11,28,18],[29,11,29,14],[29,15,29,18],[30,13,30,14],[30,17,30,18],[33,0,34,5],[33,6,33,9],[33,11,33,14],[33,15,33,18],[34,6,34,10],[34,11,34,14],[34,15,34,18],[32,0,32,8],[32,9,32,10],[32,11,32,13],[32,15,32,17],[35,0,36,10],[35,11,35,14],[35,15,35,18],[36,11,36,14],[36,15,36,18],[37,0,38,10],[37,11,38,12],[37,13,38,13],[37,14,38,16],[37,17,38,18],[42,5,42,6],[42,7,42,8],[42,0,42,4],[39,0,39,8],[39,11,40,18],[40,0,40,4],[40,5,40,6],[40,7,40,8],[41,1,41,4],[41,5,41,6],[41,11,41,14],[41,15,41,18],[49,0,51,1],[49,2,51,8],[49,9,51,10],[49,11,51,18],[52,0,52,18],[53,0,53,18],[43,0,43,8],[44,0,44,8],[45,0,46,18],[47,0,48,1],[47,2,48,8],[47,9,48,10],[47,11,48,18],[58,2,59,8],[58,9,59,10],[58,11,59,18],[60,0,61,1],[60,9,62,10],[60,11,62,18],[54,0,54,18],[55,0,55,8],[55,9,55,18],[56,0,57,2],[56,3,57,5],[56,6,56,8],[56,9,57,11],[56,12,57,15],[56,16,56,18],[57,6,57,8],[71,15,72,18],[41,7,41,8],[39,9,44,10],[42,11,44,14],[42,15,44,18],[68,0,68,8],[68,9,68,18],[69,0,69,8],[69,9,69,18],[70,0,70,18],[71,0,72,2],[71,3,72,3],[71,4,72,6],[71,7,72,10],[71,11,72,14],[63,0,64,1],[63,2,64,8],[63,9,64,10],[63,11,64,18],[65,0,66,1],[65,9,66,10],[65,11,67,18],[57,16,57,18],[58,0,59,1]]}
[]
[null,null,null,null,"                                                                                                                                                     COMISIÓN NACIONAL DEL SERVICIO CIVIL\n    ",null,null,null,null,null,null,null,null,null,null,"INSERTE EL LOGOTIPO DE SU ENTIDAD"]
[]
[null,null,null,null,"FORMATO 9. EVALUACIÓN EXTRAORDINARIA"]
[]
[null,null,null,null,"PROCESO: EVALUACIÓN DEL DESEMPEÑO LABORAL",null,null,"Código:  ",null,"F-ED-010",null,"Página",null,"1 de 1"]
[null,null,null,null,null,null,null,"Fecha de emisión: ",null,"2016-12-27",null,"Versión: ",null,"2.0"]
["PERÍODO DE EVALUACIÓN",null,null,null,"DÍA","MES","AÑO","al",null,"DÍA","MES","AÑO","FECHA DE EVALUACIÓN",null,null,null,"DÍA","MES","AÑO"]
[]
["I. IDENTIFICACIÓN DEL EVALUADO"]
["Tipo de Documento",null,"Número de identificación",null,null,"Primer apellido",null,null,"Segundo apellido",null,null,"Primer nombre",null,null,null,"Otros nombres"]
[{"$f":"+'F1. INF. GENERAL'!A13:B13","v":"Cédula de ciudadanía"},null,{"$f":"+'F1. INF. GENERAL'!C13:E13","v":0},null,null,{"$f":"+'F1. INF. GENERAL'!F13:H13","v":0},null,null,{"$f":"+'F1. INF. GENERAL'!I13:K13","v":""},null,null,{"$f":"+'F1. INF. GENERAL'!L13:O13","v":""},null,null,null,{"$f":"+'F1. INF. GENERAL'!P13:S13","v":""}]
["Dependencia o área a la que pertenece el evaluado",null,null,null,null,null,null,null,"Denominación del empleo"]
[{"$f":"+'F1. INF. GENERAL'!A15:H15","v":""},null,null,null,null,null,null,null,{"$f":"+'F1. INF. GENERAL'!I15:S15","v":""}]
["Nivel jerárquico",null,null,null,null,"Código",null,"Grado",{"$f":"'[3]F2. COMP. LAB Y COM COMPOR'!I16","v":"Propósito del empleo:"},null,{"$f":"+'F1. INF. GENERAL'!J16","v":""}]
[{"$f":"+'F1. INF. GENERAL'!A17:E17","v":""},null,null,null,null,{"$f":"+'F1. INF. GENERAL'!F17:G17","v":""},null,{"$f":"+'F1. INF. GENERAL'!H17","v":""}]
["II. IDENTIFICACIÓN EVALUADOR. (Jefe inmediato)"]
["Tipo de documento",null,"Número de identificación",null,null,"Primer apellido",null,null,"Segundo apellido",null,null,"Primer nombre",null,null,null,"Otros nombres"]
[{"$f":"+'F1. INF. GENERAL'!A20:B20","v":"Cédula de ciudadanía"},null,{"$f":"+'F1. INF. GENERAL'!C20:E20","v":""},null,null,{"$f":"+'F1. INF. GENERAL'!F20:H20","v":""},null,null,{"$f":"+'F1. INF. GENERAL'!I20:K20","v":""},null,null,{"$f":"+'F1. INF. GENERAL'!L20:O20","v":""},null,null,null,{"$f":"+'F1. INF. GENERAL'!P20:S20","v":""}]
[" Área o Dependencia a la que pertenece el evaluador",null,null,null,null,null,"Denominación del empleo",null,null,null,null,null,null,"Código",null,"Grado",null,"Nivel jerárquico"]
[{"$f":"+'F1. INF. GENERAL'!A22:F22","v":""},null,null,null,null,null,{"$f":"+'F1. INF. GENERAL'!G22:M22","v":""},null,null,null,null,null,null,{"$f":"+'F1. INF. GENERAL'!N22:O22","v":""},null,{"$f":"+'F1. INF. GENERAL'!P22:Q22","v":""},null,{"$f":"+'F1. INF. GENERAL'!R22:S22","v":""}]
["III. IDENTIFICACIÓN EVALUADOR (Servidor público de Libre Nombramiento y Remoción en caso de constituir Comisión Evaluadora)"]
["Tipo de documento",null,"Número de identificación",null,null,"Primer apellido",null,null,"Segundo apellido",null,null,"Primer nombre",null,null,null,"Otros nombres"]
[{"$f":"+'F1. INF. GENERAL'!A25:B25","v":"Cédula de ciudadanía"},null,{"$f":"+'F1. INF. GENERAL'!C25:E25","v":"NO REQUIERE"},null,null,{"$f":"+'F1. INF. GENERAL'!F25:H25","v":"NO REQUIERE"},null,null,{"$f":"+'F1. INF. GENERAL'!I25:K25","v":"NO REQUIERE"},null,null,{"$f":"+'F1. INF. GENERAL'!L25:O25","v":"NO REQUIERE"},null,null,null,{"$f":"+'F1. INF. GENERAL'!P25:S25","v":"NO REQUIERE"}]
["Dependencia o área a la que pertenece el evaluador",null,null,null,null,null,"Denominación del empleo",null,null,null,null,null,null,"Código",null,"Grado",null,"Nivel jerárquico"]
[{"$f":"+'F1. INF. GENERAL'!A27:F27","v":"NO REQUIERE"},null,null,null,null,null,{"$f":"+'F1. INF. GENERAL'!G27:M27","v":"NO REQUIERE"},null,null,null,null,null,null,{"$f":"+'F1. INF. GENERAL'!N27:O27","v":"NO REQUIERE"},null,{"$f":"+'F1. INF. GENERAL'!P27:Q27","v":"NO REQUIERE"},null,{"$f":"+'F1. INF. GENERAL'!R27:S27","v":"NO REQUIERE"}]
["IV. COMPROMISOS LABORALES"]
["Metas de la Dependencia a las cuales contribuye el empleo",null,null,null,"Compromisos Laborales.",null,null,null,null,"Peso porcentual del compromiso",null,"Porcentaje de Cumplimiento. "]
[]
[null,null,null,null,null,null,null,null,null,null,null," EVALUACIÓN REALIZADA PREVIA A LA EXTRAORDINARIA (Si hubo)",null,null,null,"EVALUACIÓN ULTIMO PERÍODO"]
[null,null,null,null,null,null,null,null,null,null,null,"Peso porcentual  Evaluaciones previas","CALIFICACIÓN DEL COMPROMISO","CALIFICACIÓN DEL COMPROMISO \n(Con peso porcentual)",null,"Peso porcentual  último período","CALIFICACIÓN DEL COMPROMISO","CALIFICACIÓN DEL COMPROMISO \n(Con peso porcentual)"]
["Ver hoja de consolidación",null,null,null,"Ver hoja de consolidación",null,null,null,null,1,null,null,null,{"$f":"IFERROR(($M32*L32),0)","v":0},null,{"$f":"IFERROR((J32-L32),0)","v":1},null,{"$f":"IFERROR(($Q32*P32),0)","v":0}]
[" PESO TOTAL PONDERADO DE LOS COMPROMISOS LABORALES",null,null,null,null,null,null,null,null,{"$f":"IF(SUM(J32:K32)<1,CONCATENATE(\"ERROR!!: Sumatoria menor a 100% (\",TEXT(SUM(J32:K32),\"0%)\")),SUM(J32:K32))","v":1},null,"Resultado total ",null,null,{"$f":"N32","v":0},"Resultado total ",null,null,{"$f":"+R32","v":0}]
["Días Efectivamente Laborados",null,null,null,null,null,"Total Días Laborados Efectivamente",null,null,null,{"$f":"IF((L34+P34)<91,\"No aplica\",SUM(L34:S34))","v":"No aplica"}]
[null,null,null,null,null,null,"% Participación Días Laborados para la Evaluación Extraordinaria",null,null,null,null,{"$f":"IF(L34>30,IFERROR(+L34/($L$34+$P$34),0),\"DEBE SER SUPERIOR A 30 DIAS\")","v":"DEBE SER SUPERIOR A 30 DIAS"},null,null,null,{"$f":"IF((L34+P34)>90,IFERROR(+P34/($L$34+$P$34),0),\"DEBE SER SUPERIOR A 90 DIAS\")","v":"DEBE SER SUPERIOR A 90 DIAS"}]
["Calificaciones parciales semestrales compromisos laborales ",null,null,null,null,null,null,null,null,null,null,"1° Calificación",null,null,null,"2° Calificación"]
[null,null,null,null,null,null,null,null,null,null,null,{"$f":"O33*40","v":0},null,null,null,{"$f":"S33*40","v":0}]
["CALIFICACIÓN TOTAL COMPROMISOS LABORALES",null,null,null,null,null,null,null,null,null,null,"Sobre el 100%",null,{"$f":"(IF(L35=\"DEBE SER SUPERIOR A 30 DIAS\",0,IF(L35>0,(L35*O33),0)))+(IF(P35=\"DEBE SER SUPERIOR A 90 DIAS\",0,IF(P35>0,(S33*P35),0)))","v":0},"Sobre el peso porcentual del 85%",null,null,{"$f":"+N38*85%","v":0}]
[]
["V. COMPETENCIAS COMPORTAMENTALES",null,null,null,null,null,null,null,null,null,null,"VI. RESULTADOS CONSOLIDADOS EVALUCIÓN EXTRAORDINARIA"]
["COMPETENCIAS COMPORTAMENTALES",null,null,null,null,"Eva. Previa a la EXTR.\n(Si hubo)",null,"Eva. Último período."]
["1.  ","Ver hoja de consolidación",null,null,null,null,null,null,null,null,null,"CALIFICACIÓN",null,null,null,"NIVEL DE CALIFICACIÓN"]
["% Participación Días Laborados de cada Eva. Eventual",null,null,null,null,{"$f":"IF(L34=\"\",0,IF(L35>0,(F42*L35),0))","v":0},null,{"$f":"IF(P34=\"\",0,IF(P35>0,(H42*P35),0))","v":0},null,null,null,{"$f":"(R38+((A45*15)/10))","v":0},null,null,null,{"$f":"IFERROR(VLOOKUP(L43,Hoja4!AA3:AB1002,2),\"NO APLICA\")","v":"NO APLICA"}]
["DESARROLLO DE LAS COMPETENCIAS COMPORTAMENTALES"]
[{"$f":"+F43+H43","v":0}]
["VII. NOTIFICACIÓN"]
[]
["Nombre del Evaluado:",null,{"$f":"UPPER(CONCATENATE(L12,\" \",P12,\" \",F12,\" \",I12))","v":"  0 "},null,null,null,null,null,null,"Nombre del evaluador:",null,{"$f":"UPPER(CONCATENATE(L19,\" \",P19,\" \",F19,\" \",I19))","v":"   "}]
[]
["Firma",null,null,null,null,null,null,null,null,"Firma"]
[]
[]
["VIII. DECISIÓN DE RECURSOS"]
["Interpone recursos"]
["SI"]
["RECURSO DE REPOSICIÓN",null,null,null,null,null,null,null,null,"RECURSO DE APELACIÓN"]
["DECISIÓN",null,null,null,null,null,"FECHA",null,null,"DECISIÓN",null,null,null,null,null,null,"FECHA"]
[]
["Nombre del Evaluado:",null,{"$f":"IF(D57=\"\",\"\",UPPER(CONCATENATE(L12,\" \",P12,\" \",F12,\" \",I12)))","v":""},null,null,null,null,null,null,"Nombre del Evaluado:",null,{"$f":"IF(M57=\"\",\"\",UPPER(CONCATENATE(L12,\" \",P12,\" \",F12,\" \",I12)))","v":""}]
[]
["Firma",null,null,null,null,null,null,null,null,"Firma"]
[]
[]
["Nombre del Notificador:",null,null,null,null,null,null,null,null,"Nombre del Notificador:"]
[]
["Firma",null,null,null,null,null,null,null,null,"Firma"]
[]
[]
["MOTIVACIÓN (Anexar Acto Administrativo):",null,null,null,null,null,null,null,null,"MOTIVACIÓN (Anexar Acto Administrativo):"]
[]
["IX. CALIFICACIÓN DEFINITIVA"]
["CALIFICACIÓN DEFINITIVA EN FIRME",null,null,null,"FIRMA Y NÚMERO DE CÉDULA DEL NOTIFICADO",null,null,null,null,null,null,"FIRMA Y NÚMERO DE CÉDULA DEL NOTIFICADOR"]
[]
[]
[]
[]
[]
[]
[]
[]
[]
[]
[]
[]
[]
[]
[]
[]
[]
[]
[]
[]
[]
[]
[]
[]
[]
[]
[]
[]
[]
[]
[]
[]
[null,null,null,null,null,null,null,null,null,null,null,"Cedula de ciudadanía"]
[null,null,null,null,null,null,null,null,null,null,null,"Cedula de extranjería"]
[]
[]
[]
[]
[]
[]
[]
[]
[]
[]
[]
[]
[]
[]
[]
[null,null,null,"Asesor"]
[null,null,null,"profesional"]
[null,null,null,"Técnico"]
[null,null,null,"Asistencial"]
[]
[]
[]
[]
[]
[]
[]
[]
[]
[]
[]
[]
[]
[]
[]
[]
[]
[]
[]
[]
[null,null,null,null,null,null,null,null,null,60]
[null,null,null,null,null,null,null,null,null,61]
[null,null,null,null,null,null,null,null,null,62]
[null,null,null,null,null,null,null,null,null,63]
[null,null,null,null,null,null,null,null,null,64]
[null,null,null,null,null,null,null,null,null,65]
[null,null,null,null,null,null,null,null,null,66]
[null,null,null,null,null,null,null,null,null,67]
[null,null,null,null,null,null,null,null,null,68]
[null,null,null,null,null,null,null,null,null,69]
[null,null,null,null,null,null,null,null,null,70]
[null,null,null,null,null,null,null,null,null,71]
[null,null,null,null,null,null,null,null,null,72]
[null,null,null,null,null,null,null,null,null,73]
[null,null,null,null,null,null,null,null,null,74]
[null,null,null,null,null,null,null,null,null,75]
[null,null,null,null,null,null,null,null,null,76]
[null,null,null,null,null,null,null,null,null,77]
[null,null,null,null,null,null,null,null,null,78]
[null,null,null,null,null,null,null,null,null,79]
[null,null,null,null,null,null,null,null,null,80]
[null,null,null,null,null,null,null,null,null,81]
[null,null,null,null,null,null,null,null,null,82]
[null,null,null,null,null,null,null,null,null,83]
[null,null,null,null,null,null,null,null,null,84]
[null,null,null,null,null,null,null,null,null,85]
[null,null,null,null,null,null,null,null,null,86]
[null,null,null,null,null,null,null,null,null,87]
[null,null,null,null,null,null,null,null,null,88]
[null,null,null,null,null,null,null,null,null,89]
[null,null,null,null,null,null,null,null,null,90]
[null,null,null,null,null,null,null,null,null,91]
[null,null,null,null,null,null,null,null,null,92]
[null,null,null,null,null,null,null,null,null,93]
[null,null,null,null,null,null,null,null,null,94]
[null,null,null,null,null,null,null,null,null,95]
[null,null,null,null,null,null,null,null,null,96]
[null,null,null,null,null,null,null,null,null,97]
[null,null,null,null,null,null,null,null,null,98]
[null,null,null,null,null,null,null,null,null,99]
[null,null,null,null,null,null,null,null,null,100]

{"sheet":"F10. EVA. INFERIOR A 1 AÑO","index":5,"n_rows":186,"n_cols":19,"rows_kept":186,"cut":false,"hidden":false,"merged":[[6,9,6,10],[6,11,6,12],[6,13,6,14],[7,0,8,3],[7,7,8,8],[7,12,8,15],[1,0,6,3],[1,4,2,14],[1,15,6,18],[3,4,4,14],[5,4,6,6],[5,7,5,8],[5,9,5,10],[5,11,5,12],[5,13,5,14],[6,7,6,8],[11,0,11,1],[11,2,11,4],[11,5,11,7],[11,8,11,10],[11,11,11,14],[11,15,11,18],[9,0,9,18],[10,0,10,1],[10,2,10,4],[10,5,10,7],[10,8,10,10],[10,11,10,14],[10,15,10,18],[12,0,12,7],[12,8,12,18],[13,0,13,7],[13,8,13,18],[14,0,14,4],[14,5,14,6],[14,8,15,10],[14,11,15,18],[15,0,15,4],[15,5,15,6],[18,0,18,1],[18,2,18,4],[18,5,18,7],[18,8,18,10],[18,11,18,14],[18,15,18,18],[16,0,16,18],[17,0,17,1],[17,2,17,4],[17,5,17,7],[17,8,17,10],[17,11,17,14],[17,15,17,18],[19,0,19,5],[19,6,19,12],[19,13,19,14],[19,15,19,16],[19,17,19,18],[20,0,20,5],[20,6,20,12],[20,13,20,14],[20,15,20,16],[20,17,20,18],[23,0,23,1],[23,2,23,4],[23,5,23,7],[23,8,23,10],[23,11,23,14],[23,15,23,18],[21,0,21,18],[22,0,22,1],[22,2,22,4],[22,5,22,7],[22,8,22,10],[22,11,22,14],[22,15,22,18],[24,0,24,5],[24,6,24,12],[24,13,24,14],[24,15,24,16],[24,17,24,18],[25,0,25,5],[25,6,25,12],[25,13,25,14],[25,15,25,16],[25,17,25,18],[31,17,31,18],[31,0,31,3],[31,4,31,8],[31,9,31,10],[31,13,31,14],[26,0,26,18],[27,0,30,3],[27,4,30,8],[27,9,30,10],[27,11,28,18],[29,11,29,14],[29,15,29,18],[30,13,30,14],[30,17,30,18],[33,0,34,5],[33,6,33,10],[33,11,33,14],[33,15,33,18],[34,6,34,10],[34,11,34,14],[34,15,34,18],[32,0,32,8],[32,9,32,10],[32,11,32,13],[32,15,32,17],[35,0,36,10],[35,11,35,18],[36,11,36,14],[36,15,36,18],[37,0,38,10],[37,11,38,13],[37,14,38,14],[37,15,38,17],[37,18,38,18],[45,0,46,18],[47,0,48,1],[47,2,48,8],[47,9,48,10],[47,11,48,18],[49,0,51,1],[49,2,51,8],[49,9,51,10],[49,11,51,18],[52,0,52,18],[53,0,53,18],[54,0,54,18],[55,0,55,8],[55,9,55,18],[56,0,57,2],[56,3,57,5],[56,6,56,8],[56,9,57,11],[56,12,57,15],[60,0,61,1],[60,9,62,10],[60,11,62,18],[63,0,64,1],[63,2,64,8],[63,9,64,10],[63,11,64,18],[56,16,56,18],[57,6,57,8],[57,16,57,18],[58,0,59,1],[58,2,59,8],[58,9,59,10],[58,11,59,18],[70,0,70,18],[71,0,72,2],[71,3,72,3],[71,4,72,6],[71,7,72,10],[71,11,72,14],[71,15,72,18],[65,0,66,1],[65,9,66,10],[65,11,67,18],[68,0,68,8],[68,9,68,18],[69,0,69,8],[69,9,69,18],[42,0,42,4],[43,0,43,8],[44,0,44,8],[39,9,44,10],[40,11,40,14],[40,15,40,18],[43,11,43,14],[43,15,43,18],[41,11,42,18],[44,11,44,14],[44,15,44,18],[41,7,41,8],[42,5,42,6],[42,7,42,8],[39,0,39,8],[39,11,39,18],[40,0,40,4],[40,5,40,6],[40,7,40,8],[41,1,41,4],[41,5,41,6]]}
[]
[null,null,null,null,"COMISIÓN NACIONAL DEL SERVICIO CIVIL",null,null,null,null,null,null,null,null,null,null,"INSERTE EL LOGOTIPO DE SU ENTIDAD"]
[]
[null,null,null,null,"FORMATO 10 EVALUACIÓN INFERIOR A UN (1) AÑO."]
[]
[null,null,null,null,"PROCESO: EVALUACIÓN DEL DESEMPEÑO LABORAL",null,null,"Código:  ",null,"F-ED-011",null,"Página",null,"1 de 1"]
[null,null,null,null,null,null,null,"Fecha de emisión: ",null,"2016-12-27",null,"Versión: ",null,"2.0"]
["PERÍODO DE EVALUACIÓN",null,null,null,"DÍA","MES","AÑO","al",null,"DÍA","MES","AÑO","FECHA DE EVALUACIÓN",null,null,null,"DÍA","MES","AÑO"]
[]
["I. IDENTIFICACIÓN DEL EVALUADO"]
["Tipo de Documento",null,"Número de identificación",null,null,"Primer apellido",null,null,"Segundo apellido",null,null,"Primer nombre",null,null,null,"Otros nombres"]
[{"$f":"+'F1. INF. GENERAL'!A13:B13","v":"Cédula de ciudadanía"},null,{"$f":"+'F1. INF. GENERAL'!C13:E13","v":0},null,null,{"$f":"+'F1. INF. GENERAL'!F13:H13","v":0},null,null,{"$f":"+'F1. INF. GENERAL'!I13:K13","v":""},null,null,{"$f":"+'F1. INF. GENERAL'!L13:O13","v":""},null,null,null,{"$f":"+'F1. INF. GENERAL'!P13:S13","v":""}]
["Dependencia o área a la que pertenece el evaluado",null,null,null,null,null,null,null,"Denominación del empleo"]
[{"$f":"+'F1. INF. GENERAL'!A15:H15","v":""},null,null,null,null,null,null,null,{"$f":"+'F1. INF. GENERAL'!I15:S15","v":""}]
["Nivel jerárquico",null,null,null,null,"Código",null,"Grado",{"$f":"'[3]F2. COMP. LAB Y COM COMPOR'!I16","v":"Propósito del empleo:"},null,null,{"$f":"+'F1. INF. GENERAL'!J16","v":""}]
[{"$f":"+'F1. INF. GENERAL'!A17:E17","v":""},null,null,null,null,{"$f":"+'F1. INF. GENERAL'!F17:G17","v":""},null,{"$f":"+'F1. INF. GENERAL'!H17","v":""}]
["II. IDENTIFICACIÓN EVALUADOR. (Jefe inmediato)"]
["Tipo de documento",null,"Número de identificación",null,null,"Primer apellido",null,null,"Segundo apellido",null,null,"Primer nombre",null,null,null,"Otros nombres"]
[{"$f":"+'F1. INF. GENERAL'!A20:B20","v":"Cédula de ciudadanía"},null,{"$f":"+'F1. INF. GENERAL'!C20:E20","v":""},null,null,{"$f":"+'F1. INF. GENERAL'!F20:H20","v":""},null,null,{"$f":"+'F1. INF. GENERAL'!I20:K20","v":""},null,null,{"$f":"+'F1. INF. GENERAL'!L20:O20","v":""},null,null,null,{"$f":"+'F1. INF. GENERAL'!P20:S20","v":""}]
[" Área o Dependencia a la que pertenece el evaluador",null,null,null,null,null,"Denominación del empleo",null,null,null,null,null,null,"Código",null,"Grado",null,"Nivel jerárquico"]
[{"$f":"+'F1. INF. GENERAL'!A22:F22","v":""},null,null,null,null,null,{"$f":"+'F1. INF. GENERAL'!G22:M22","v":""},null,null,null,null,null,null,{"$f":"+'F1. INF. GENERAL'!N22:O22","v":""},null,{"$f":"+'F1. INF. GENERAL'!P22:Q22","v":""},null,{"$f":"+'F1. INF. GENERAL'!R22:S22","v":""}]
["III. IDENTIFICACIÓN EVALUADOR (Servidor público de Libre Nombramiento y Remoción en caso de constituir Comisión Evaluadora)"]
["Tipo de documento",null,"Número de identificación",null,null,"Primer apellido",null,null,"Segundo apellido",null,null,"Primer nombre",null,null,null,"Otros nombres"]
[{"$f":"+'F1. INF. GENERAL'!A25:B25","v":"Cédula de ciudadanía"},null,{"$f":"+'F1. INF. GENERAL'!C25:E25","v":"NO REQUIERE"},null,null,{"$f":"+'F1. INF. GENERAL'!F25:H25","v":"NO REQUIERE"},null,null,{"$f":"+'F1. INF. GENERAL'!I25:K25","v":"NO REQUIERE"},null,null,{"$f":"+'F1. INF. GENERAL'!L25:O25","v":"NO REQUIERE"},null,null,null,{"$f":"+'F1. INF. GENERAL'!P25:S25","v":"NO REQUIERE"}]
["Dependencia o área a la que pertenece el evaluador",null,null,null,null,null,"Denominación del empleo",null,null,null,null,null,null,"Código",null,"Grado",null,"Nivel jerárquico"]
[{"$f":"+'F1. INF. GENERAL'!A27:F27","v":"NO REQUIERE"},null,null,null,null,null,{"$f":"+'F1. INF. GENERAL'!G27:M27","v":"NO REQUIERE"},null,null,null,null,null,null,{"$f":"+'F1. INF. GENERAL'!N27:O27","v":"NO REQUIERE"},null,{"$f":"+'F1. INF. GENERAL'!P27:Q27","v":"NO REQUIERE"},null,{"$f":"+'F1. INF. GENERAL'!R27:S27","v":"NO REQUIERE"}]
["IV. COMPROMISOS LABORALES"]
["Metas de la Dependencia las cuales contribuye el empleo",null,null,null,"Compromisos Laborales.",null,null,null,null,"Peso porcentual del compromiso",null,"Porcentaje de Cumplimiento. "]
[]
[null,null,null,null,null,null,null,null,null,null,null," EVALUACIÓN REALIZADA PREVIA A LA PRESENTE",null,null,null,"EVALUACIÓN ULTIMO PERÍODO"]
[null,null,null,null,null,null,null,null,null,null,null,"Peso porcentual  Evaluaciones previas","CALIFICACIÓN DEL COMPROMISO","CALIFICACIÓN DEL COMPROMISO \n(Con peso porcentual)",null,"Peso porcentual  último período","CALIFICACIÓN DEL COMPROMISO","CALIFICACIÓN DEL COMPROMISO \n(Con peso porcentual)"]
["Ver hoja de consolidación",null,null,null,"Ver hoja de consolidación",null,null,null,null,1,null,null,null,{"$f":"IFERROR(($M32*L32),0)","v":0},null,{"$f":"IFERROR((J32-L32),0)","v":1},null,{"$f":"IFERROR(($Q32*P32),0)","v":0}]
[" PESO TOTAL PONDERADO DE LOS COMPROMISOS LABORALES",null,null,null,null,null,null,null,null,{"$f":"IF(SUM(J32:K32)<1,CONCATENATE(\"ERROR!!: Sumatoria menor a 100% (\",TEXT(SUM(J32:K32),\"0%)\")),SUM(J32:K32))","v":1},null,"Resultado total ",null,null,{"$f":"+N32","v":0},"Resultado total ",null,null,{"$f":"+R32/100","v":0}]
["Días Efectivamente Laborados",null,null,null,null,null,"Total Días Laborados de cada Evaluación Eventual"]
[null,null,null,null,null,null,"% Participación Días Laborados de cada Evaluación Eventual",null,null,null,null,{"$f":"IF(L34>30,IFERROR(+L34/($L$34+$P$34),0),\"DEBE SER SUPERIOR A 30 DIAS\")","v":"DEBE SER SUPERIOR A 30 DIAS"},null,null,null,{"$f":"IF(P34<31,\"DEBE SER SUPERIOR A 30 DIAS\",IF(SUM(L34:S34)<270,IFERROR(+P34/($L$34+$P$34),0),\"DILIGENCIE EN FORMATO F1\"))","v":"DEBE SER SUPERIOR A 30 DIAS"}]
["Calificaciones parciales semestrales compromisos laborales ",null,null,null,null,null,null,null,null,null,null,"Calificación total"]
[null,null,null,null,null,null,null,null,null,null,null,{"$f":"O33*40","v":0},null,null,null,{"$f":"S33*40","v":0}]
["CALIFICACIÓN TOTAL COMPROMISOS LABORALES",null,null,null,null,null,null,null,null,null,null,"Sobre el 100%",null,null,{"$f":"(IF(L35=\"DEBE SER SUPERIOR A 30 DIAS\",0,IF(L35>0,(L35*O33),0)))+(IF(P35=\"DEBE SER SUPERIOR A 30 DIAS\",0,IF(P35>0,(S33*P35),0)))*100","v":0},"Sobre el peso porcentual del 80%",null,null,{"$f":"+O38*80%","v":0}]
[]
["V. COMPETENCIAS COMPORTAMENTALES",null,null,null,null,null,null,null,null,null,null,"VI. EVALUACIÓN DE GESTIÓN POR ÁREAS O DEPENDENCIAS"]
["COMPETENCIAS COMPORTAMENTALES",null,null,null,null,"Última Ev. Realizada",null,"Evaluac. Ordinaria",null,null,null,"CALIFICACIÓN DE LA EVALUACIÓN DE GESTIÓN POR ÁREAS O  DEPENDENCIAS."]
["1.  ","Ver hoja de consolidación",null,null,null,null,null,null,null,null,null,"VII. RESULTADOS CONSOLIDADOS COMPONENTES DE LA EVALUACIÓN DE DESEMPEÑO LABORAL PARA LA EVALUACIÓN INFERIOR A UN AÑO."]
["% Participación Días Laborados de cada Eva. Eventual",null,null,null,null,{"$f":"IF(L34=\"\",0,IF(L35>0,(F42*L35),0))","v":0},null,{"$f":"IF(P34=\"\",0,IF(P35>0,(H42*P35),0))","v":0}]
["DESARROLLO DE LAS COMPETENCIAS COMPORTAMENTALES",null,null,null,null,null,null,null,null,null,null,"CALIFICACIÓN",null,null,null,"NIVEL DE CALIFICACIÓN"]
[{"$f":"+F43+H43","v":0},null,null,null,null,null,null,null,null,null,null,{"$f":"+S38+A45+P41","v":0},null,null,null,{"$f":"IFERROR(VLOOKUP(L45,Hoja4!AA3:AB1002,2),\"NO APLICA\")","v":"NO APLICA"}]
["VIII. NOTIFICACIÓN"]
[]
["Nombre del Evaluado:",null,{"$f":"UPPER(CONCATENATE(L12,\" \",P12,\" \",F12,\" \",I12))","v":"  0 "},null,null,null,null,null,null,"Nombre del evaluador:",null,{"$f":"UPPER(CONCATENATE(L19,\" \",P19,\" \",F19,\" \",I19))","v":"   "}]
[]
["Firma",null,null,null,null,null,null,null,null,"Firma"]
[]
[]
["IX. DECISION DE RECURSOS"]
["Interpone recursos"]
["SI"]
["RECURSO DE REPOSICIÓN",null,null,null,null,null,null,null,null,"RECURSO DE APELACIÓN"]
["DECISIÓN",null,null,null,null,null,"FECHA",null,null,"DECISIÓN",null,null,null,null,null,null,"FECHA"]
[]
["Nombre del Evaluado:",null,{"$f":"IF(D57=\"\",\"\",UPPER(CONCATENATE(L12,\" \",P12,\" \",F12,\" \",I12)))","v":""},null,null,null,null,null,null,"Nombre del Evaluado:",null,{"$f":"IF(M57=\"\",\"\",UPPER(CONCATENATE(L12,\" \",P12,\" \",F12,\" \",I12)))","v":""}]
[]
["Firma",null,null,null,null,null,null,null,null,"Firma"]
[]
[]
["Nombre del Notificador:",null,null,null,null,null,null,null,null,"Nombre del Notificador:"]
[]
["Firma",null,null,null,null,null,null,null,null,"Firma"]
[]
[]
["MOTIVACIÓN (Anexar Acto Administrativo):",null,null,null,null,null,null,null,null,"MOTIVACIÓN (Anexar Acto Administrativo):"]
[]
["X. CALIFICACIÓN DEFINITIVA"]
["CALIFICACIÓN DEFINITIVA EN FIRME",null,null,null,"FIRMA Y NÚMERO DE CÉDULA DEL NOTIFICADO",null,null,null,null,null,null,"FIRMA Y NÚMERO DE CÉDULA DEL NOTIFICADOR"]
[]
[null,null,null,null,null,null,"}"]
[]
[]
[]
[]
[]
[]
[]
[]
[]
[]
[]
[]
[]
[]
[]
[]
[]
[]
[]
[]
[]
[]
[]
[]
[]
[]
[]
[]
[]
[]
[null,null,null,null,null,null,null,null,null,null,null,"Cedula de ciudadanía"]
[null,null,null,null,null,null,null,null,null,null,null,"Cedula de extranjería"]
[]
[]
[]
[]
[]
[]
[]
[]
[]
[]
[]
[]
[]
[]
[]
[null,null,null,"Asesor"]
[null,null,null,"profesional"]
[null,null,null,"Técnico"]
[null,null,null,"Asistencial"]
[]
[]
[]
[]
[]
[]
[]
[]
[]
[]
[]
[]
[]
[]
[]
[]
[]
[]
[]
[]
[null,null,null,null,null,null,null,null,null,60]
[null,null,null,null,null,null,null,null,null,61]
[null,null,null,null,null,null,null,null,null,62]
[null,null,null,null,null,null,null,null,null,63]
[null,null,null,null,null,null,null,null,null,64]
[null,null,null,null,null,null,null,null,null,65]
[null,null,null,null,null,null,null,null,null,66]
[null,null,null,null,null,null,null,null,null,67]
[null,null,null,null,null,null,null,null,null,68]
[null,null,null,null,null,null,null,null,null,69]
[null,null,null,null,null,null,null,null,null,70]
[null,null,null,null,null,null,null,null,null,71]
[null,null,null,null,null,null,null,null,null,72]
[null,null,null,null,null,null,null,null,null,73]
[null,null,null,null,null,null,null,null,null,74]
[null,null,null,null,null,null,null,null,null,75]
[null,null,null,null,null,null,null,null,null,76]
[null,null,null,null,null,null,null,null,null,77]
[null,null,null,null,null,null,null,null,null,78]
[null,null,null,null,null,null,null,null,null,79]
[null,null,null,null,null,null,null,null,null,80]
[null,null,null,null,null,null,null,null,null,81]
[null,null,null,null,null,null,null,null,null,82]
[null,null,null,null,null,null,null,null,null,83]
[null,null,null,null,null,null,null,null,null,84]
[null,null,null,null,null,null,null,null,null,85]
[null,null,null,null,null,null,null,null,null,86]
[null,null,null,null,null,null,null,null,null,87]
[null,null,null,null,null,null,null,null,null,88]
[null,null,null,null,null,null,null,null,null,89]
[null,null,null,null,null,null,null,null,null,90]
[null,null,null,null,null,null,null,null,null,91]
[null,null,null,null,null,null,null,null,null,92]
[null,null,null,null,null,null,null,null,null,93]
[null,null,null,null,null,null,null,null,null,94]
[null,null,null,null,null,null,null,null,null,95]
[null,null,null,null,null,null,null,null,null,96]
[null,null,null,null,null,null,null,null,null,97]
[null,null,null,null,null,null,null,null,null,98]
[null,null,null,null,null,null,null,null,null,99]
[null,null,null,null,null,null,null,null,null,100]

{"sheet":"Hoja1","index":6,"n_rows":28,"n_cols":3,"rows_kept":28,"cut":false,"hidden":true,"merged":[]}
[]
["Competencia","Definición de la competencia","Conductas asociadas"]
["Adaptación al cambio","Enfrentarse con flexibilidad y versatilidad a situaciones nuevas para aceptar los cambios positiva y constructivamente.","▪Acepta y se adapta fácilmente los cambios.\n▪Responde al cambio con flexibilidad.\n▪Promueve el cambio."]
["Aprendizaje Continuo","Adquirir y desarrollar permanentemente conocimientos, destrezas y habilidades, con el fin de mantener altos estándares de eficacia organizacional.","▪Aprende de la experiencia de otros y de la propia.\n▪Se adapta y aplica nuevas tecnologías que se implanten en la organización.\n▪Aplica los conocimientos adquiridos a los desafíos que se presentan en el desarrollo del trabajo.\n▪Investiga, indaga y profundiza en los temas de su entorno área de desempeño.\n▪Reconoce las propias limitaciones y las necesidades de mejorar su preparación.\n▪Asimila nueva información y la aplica correctamente."]
["Colaboración","Cooperar con los demás con el fin de alcanzar los objetivos institucionales","▪Ayuda al logro de los objetivos articulando sus actuaciones con los demás.\n▪Cumple los compromisos que adquiere.\n▪Facilita la labor de sus superiores y compañeros de trabajo."]
["Compromiso con la Organización","Alinear el propio comportamiento a las necesidades, prioridades y metas organizacionales.","▪Promueve las metas de la organización y respeta sus normas.\n▪Antepone las necesidades de la organización a sus propias necesidades.\n▪Apoya a la organización en situaciones difíciles.\n▪Demuestra sentido de pertenencia en todas sus actuaciones."]
["Conocimiento del entorno (Asesor)","Conocer e interpretar la organización, su funcionamiento y sus relaciones políticas y administrativas.","▪Comprende el entorno organizacional que enmarca las situaciones objeto de asesoría y lo toma como referente obligado para emitir juicios, conceptos o propuestas a desarrollar.\n▪Se informa permanentemente sobre políticas gubernamentales, problemas y demandas del entorno."]
["Conocimiento del entorno (Directivo)","Estar al tanto de las circunstancias y las relaciones de poder que influyen en el entorno organizacional","• Es consciente de las condiciones específicas del entorno organizacional.\n• Está al día en los acontecimientos claves del sector y del Estado.\n• Conoce y hace seguimiento a las políticas gubernamentales.\n• Identifica las fuerzas políticas que afectan la organización y las posibles alianzas para cumplir con los propósitos organizacionales."]
["Construcción de relaciones","Establecer y mantener relaciones cordiales y recíprocas con redes o grupos de personas internas y externas a la organización que faciliten la consecución de los objetivos institucionales.","▪Utiliza sus contactos para conseguir objetivos.\n▪Comparte información para establecer lazos.\n▪Interactúa con otros de un modo efectivo y adecuado."]
["Creatividad e Innovación (Profesional)","Generar y desarrollar nuevas ideas, conceptos, métodos y soluciones.","▪Ofrece respuestas alternativas.\n▪Aprovecha las oportunidades y problemas para dar soluciones novedosas.\n▪Desarrolla nuevas formas de hacer y tecnologías.\n▪Busca nuevas alternativas de solución y se arriesga a romper esquemas tradicionales.\n▪Inicia acciones para superar los obstáculos y alcanzar metas específicas."]
["Creatividad e innovación (Técnico)","Presentar ideas y métodos novedosos y concretarlos en acciones","▪Propone y encuentra formas nuevas y eficaces de hacer las cosas.\n▪Es recursivo.\n▪Es práctico.\n▪Busca nuevas alternativas de solución.\n▪Revisa permanentemente los procesos y procedimientos para optimizar los resultados."]
["Dirección y Desarrollo de Personal","Favorecer el aprendizaje y desarrollo de sus colaboradores, articulando las potencialidades y necesidades individuales con las de la organización para optimizar la calidad de las contribuciones de los equipos de trabajo y de las personas, en el cumplimiento de los objetivos y metas organizacionales presentes y futuras.","• Identifica necesidades de formación y capacitación y propone acciones para satisfacerlas.\n• Permite niveles de autonomía con el fin de estimular el desarrollo integral del empleado.\n• Delega de manera efectiva sabiendo cuando intervenir y cuando no hacerlo.\n• Hace uso de las habilidades y recurso de su grupo de trabajo para alcanzar las metas y los estándares de productividad.\n• Establece espacios regulares de retroalimentación y reconocimiento del desempeño y sabe manejar hábilmente el bajo desempeño.\n• Tiene en cuenta las opiniones de sus colaboradores.\n• Mantiene con sus colaboradores relaciones de respeto."]
["Disciplina","Adaptarse a las políticas institucionales y buscar información de los cambios en la autoridad competente.","▪Acepta instrucciones aunque se difiera de ellas.\n▪Realiza los cometidos y tareas del puesto de trabajo.\n▪Acepta la supervisión constante.\n▪Realiza funciones orientadas a apoyar la acción de otros miembros de la organización."]
["Experticia profesional (Asesor)","Aplicar el conocimiento profesional","▪Orienta el desarrollo de proyectos especiales para el logro de resultados de la alta dirección.\n▪Aconseja y orienta la toma de decisiones en los temas que le han sido asignados.\n▪Asesora en materias propias de su campo de conocimiento, emitiendo conceptos, juicios o propuestas ajustados a lineamientos teóricos y técnicos.\n▪Se comunica de modo lógico, claro, efectivo y seguro."]
["Experticia profesional (Profesional)","Aplicar el conocimiento profesional en la resolución de problemas y transferirlo a su entorno laboral.","▪Analiza de un modo sistemático y racional los aspectos del trabajo, basándose en la información relevante.\n▪Aplica reglas básicas y conceptos complejos aprendidos\n▪Identifica y reconoce con facilidad las causas de los problemas y sus soluciones.\n▪Clarifica datos o situaciones complejas.\n▪Planea, organiza y ejecuta múltiples tareas tendientes a alcanzar resultados institucionales."]
["Experticia Técnica","Entender y aplicar los conocimientos técnicos del área de desempeño y mantenerlos actualizados","▪Capta y asimila con facilidad conceptos e información.\n▪Aplica el conocimiento técnico a las actividades cotidianas.\n▪Analiza la información de acuerdo con las necesidades de la organización.\n▪Comprende los aspectos técnicos y los aplica al desarrollo de procesos y procedimientos en los que está involucrado.\n▪Resuelve problemas utilizando sus conocimientos técnicos de su especialidad y garantizando indicadores y estándares establecidos."]
["Iniciativa","Anticiparse a los problemas iniciando acciones para superar los obstáculos y alcanzar metas concretas","▪Prevé situaciones y alternativas de solución que orientan la toma de decisiones de la alta dirección.\n▪Enfrenta los problemas y propone acciones concretas para solucionarlos.\n▪Reconoce y hace viables las oportunidades."]
["Liderazgo","Guiar y dirigir grupos y establecer y mantener la cohesión de grupo necesaria para alcanzar los objetivos organizacionales.","• Mantiene a sus colaboradores motivados.\n• Fomenta la comunicación clara, directa y concreta.\n• Constituye y mantiene grupos de trabajo con un desempeño conforme a los estándares.\n• Promueve la eficacia del equipo.\n• Genera un clima positivo y de seguridad en sus colaboradores.\n• Fomenta la participación de todos en los procesos de reflexión y de toma de decisiones.\n• Unifica esfuerzos hacia objetivos y metas institucionales."]
["Liderazgo de Grupos de Trabajo (personal a cargo)","Asumir el rol de orientar y guía de un grupo o equipo de trabajo, utilizando la autoridad con arreglo a las normas y promoviendo la Efectividad en la consecución de objetivos y metas institucionales.","▪Establece los objetivos del grupo de forma clara y equilibrada.\n▪Asegura que los integrantes del grupo compartan planes, programas y proyectos institucionales.\n▪Orienta y coordina el trabajo del grupo para la identificación de planes y actividades a seguir.\n▪Facilita la colaboración con otras áreas y dependencias.\n▪Escucha y tiene en cuenta las opiniones de los integrantes del grupo.\n▪Gestiona los recursos necesarios para poder cumplir con las metas propuestas.\n▪Garantiza los recursos necesarios para poder cumplir con las metas propuestas.\n▪Garantiza que el grupo tenga la información necesaria.\n▪Explica las razones de las decisiones."]
["Manejo de la información","Manejar con respeto las informaciones personales e institucionales de que dispone.","▪Evade temas que indagan sobre información confidencial.\n▪Recoge sólo información imprescindible para el desarrollo de la tarea.\n▪Organiza y guarda de forma adecuada la información a su cuidado, teniendo en cuenta las normas legales y de la organización.\n▪No hace pública información laboral o de las personas que pueda afectar la organización o las personas."]
["Orientación a resultados ","Realizar las funciones y cumplir los compromisos organizacionales con eficacia y calidad. ","▪ Cumple con oportunidad en función de estándares, objetivos y metas establecidas por la entidad, las funciones que le son asignadas.\n▪ Asume la responsabilidad por sus resultados.\n▪ Compromete recursos y tiempos para mejorar la productividad tomando las medidas necesarias para minimizar los riesgos.\n▪ Realiza todas las acciones necesarias para alcanzar los objetivos propuestos enfrentando los obstáculos que se presentan."]
["Orientación al usuario y al ciudadano","Dirigir las decisiones y acciones a la satisfacción de las necesidades e intereses de los usuarios internos y externos, de conformidad con las responsabilidades públicas asignadas a la entidad.","▪ Atiende y valora las necesidades y peticiones de los usuarios y de ciudadanos en general.\n▪Considera las necesidades de los usuarios al diseñar proyectos o servicios.\n▪Da respuesta oportuna a las necesidades de los usuarios de conformidad con el servicio que ofrece la entidad.\n▪Establece diferentes canales de comunicación con el usuario para conocer sus necesidades y propuestas y responde a las mismas.\n▪Reconoce la interdependencia entre su trabajo y el de otros."]
["Planeación","Determinar eficazmente las metas y prioridades institucionales, identificando las acciones, los responsables, los plazos y los recursos requeridos para alcanzarlas.","• Anticipa situaciones y escenarios futuros con acierto.\n• Establece objetivos claros y concisos, estructurados y coherentes con las metas organizacionales.\n• Traduce los objetivos estratégicos en planes prácticos y factibles.\n• Busca soluciones a los problemas.\n• Distribuye el tiempo con eficiencia.\n• Establece planes alternativos de acción."]
["Relaciones Interpersonales","Establecer y mantener relaciones de trabajo amistosas y positivas, basadas en la comunicación abierta y fluida y en el respeto por los demás.","▪Escucha con interés a las personas y capta las preocupaciones, intereses y necesidades de los demás.\n▪Transmite eficazmente las ideas, sentimientos e información impidiendo con ello malos entendidos o situaciones confusas que puedan generar conflictos."]
["Toma de decisiones","Elegir entre una o varias alternativas para solucionar un problema o atender una situación, comprometiéndose con acciones concretas y consecuentes con la decisión.","• Elige con oportunidad, entre muchas alternativas, los proyectos a realizar.\n• Efectúa cambios complejos y comprometidos en sus actividades o en las funciones que tiene asignadas cuando detecta problemas o dificultades para su realización.\n• Decide bajo presión.\n• Decide en situaciones de alta complejidad e incertidumbre."]
["Toma de decisiones (personal a cargo)","Elegir entre una o varias alternativas para solucionar un problema y tomar las acciones concretas y consecuentes con la elección realizada.","▪Elige alternativas de solución efectiva y suficiente para atender los asuntos encomendados.\n▪Decide y establece prioridades para el trabajo del grupo.\n▪Asume posiciones concretas para el manejo de temas o situaciones que demandan su atención.\n▪Efectúa cambios en las actividades o en la manera de desarrollar sus responsabilidades cuando detecta dificultades para su realización o mejores prácticas que pueden optimizar el desempeño.\n▪Asume las consecuencias de las decisiones adoptadas.\n▪Fomenta la participación en la toma de decisiones."]
["Trabajo en equipo","Trabajar con otros para conseguir metas comunes","▪Identifica claramente los objetivos del grupo y orienta su trabajo a la consecución de los mismos.\n▪Colabora con otros para la realización de actividades y metas grupales."]
["Trabajo en equipo y Colaboración","Trabajar con otros de forma conjunta y de manera participativa, integrando esfuerzos para la consecución de metas institucionales comunes.","▪Coopera en distintas situaciones y comparte información.\n▪Aporta sugerencias, ideas y opiniones.\n▪Expresa expectativas positivas del equipo o de los miembros del mismo.\n▪Planifica las propias acciones teniendo en cuenta la repercusión de las mismas para la consecución de los objetivos grupales.\n▪Establece diálogo directo con los miembros del equipo que permita compartir información e ideas en condiciones de respeto y cordialidad.\n▪Respeta criterios dispares y distintas opiniones del equipo."]

{"sheet":"Hoja4","index":7,"n_rows":1199,"n_cols":34,"rows_kept":1199,"cut":false,"hidden":true,"merged":[[447,7,449,7],[447,10,449,11],[447,8,449,9],[457,10,457,11],[456,8,456,9],[457,8,457,9],[455,10,455,11],[450,8,450,9],[451,8,451,9],[456,10,456,11],[17,17,18,17],[19,17,21,17],[22,17,24,17],[450,10,450,11],[451,10,451,11],[489,0,489,1],[501,0,501,1],[106,25,131,25],[28,25,53,25],[54,25,79,25],[80,25,105,25],[132,25,157,25],[454,8,454,9],[455,8,455,9],[158,25,183,25],[184,25,209,25],[454,10,454,11],[452,10,452,11],[453,10,453,11],[452,8,452,9],[453,8,453,9]]}
[null,null,null,null,null,null,null,null,null,null,null,null,null,0]
["CODIGO",null,"DIRECTIVO",null,null,null,null,null,null,null,null,null,null,1,null,"2016-01-01",null,null,"SI",0.01,"NO SATISFACTORIO",null,null,null,null,"UNO"]
[1050,null,"ASESOR","MODIFICA LA CALIFICACIÓN",1,6,null,1,null,2016,null,65,null,2,null,"2016-01-02",null,null,"NO",0.02,"NO SATISFACTORIO",null,null,null,"CEDULA DE CIUDADANIA","UNO",1,"NO SATISFACTORIO"]
[1020,null,"PROFESIONAL","CONFIRMA LA CALIFICACIÓN",2,9,"X",2,null,2017,null,76,null,3,null,"2016-01-03",null,null,null,0.03,"NO SATISFACTORIO",null,null,null,null,"UNO",1.1000000000000001,"NO SATISFACTORIO"]
[1060,null,"TECNICO","RECHAZA POR EXTEMPORÁNEA",3,12,null,3,null,2018,null,null,null,4,null,"2016-01-04",null,null,null,0.04,"NO SATISFACTORIO",null,null,null,null,"UNO",1.2,"NO SATISFACTORIO"]
[1045,null,"ASISTENCIAL",null,4,15,null,4,null,2019,null,null,null,5,null,"2016-01-05",null,null,null,0.05,"NO SATISFACTORIO",null,null,null,null,"UNO",1.3,"NO SATISFACTORIO"]
[2025,null,null,null,5,4,null,5,null,2020,null,null,null,6,null,"2016-01-06",null,null,null,0.06,"NO SATISFACTORIO",null,null,null,null,"UNO",1.4,"NO SATISFACTORIO"]
[2001,null,null,null,6,6,null,6,null,2021,null,null,null,7,null,"2016-01-07",null,null,null,7.0000000000000007E-2,"NO SATISFACTORIO",null,null,null,"EVALUADO","UNO",1.5,"NO SATISFACTORIO"]
[2132,null,"CEDULA DE CIUDADANIA",null,7,8,null,7,null,2022,null,null,null,8,null,"2016-01-08",null,null,null,0.08,"NO SATISFACTORIO",null,null,null,"EVALUADOR","UNO",1.6,"NO SATISFACTORIO"]
[2133,null,"CEDULA DE EXTRAJERIA",null,8,10,null,8,null,2023,null,null,null,9,null,"2016-01-09",null,null,null,0.09,"NO SATISFACTORIO",1,1,null,"TERCERO","UNO",1.7,"NO SATISFACTORIO"]
[2002,null,null,null,9,null,null,9,null,2024,null,null,null,10,null,"2016-01-10",null,null,null,0.1,"NO SATISFACTORIO",2,2,null,null,"UNO",1.8,"NO SATISFACTORIO"]
[2125,null,null,null,10,null,null,10,null,2025,null,null,null,11,null,"2016-01-11",null,null,null,0.11,"NO SATISFACTORIO",3,3,null,null,"UNO",1.9,"NO SATISFACTORIO"]
[2137,null,null,null,11,null,null,11,null,2026,null,null,null,12,null,"2016-01-12",null,null,null,0.12,"NO SATISFACTORIO",4,4,null,null,"UNO",2,"NO SATISFACTORIO"]
[2012,null,null,null,12,null,null,12,null,2027,null,null,null,13,null,"2016-01-13",null,null,null,0.13,"NO SATISFACTORIO",null,5,null,null,"UNO",2.1,"NO SATISFACTORIO"]
[2014,null,"SI",null,13,null,null,13,null,2028,null,null,null,14,null,"2016-01-14",null,null,null,0.14000000000000001,"NO SATISFACTORIO",null,6,null,null,"UNO",2.2000000000000002,"NO SATISFACTORIO"]
[2018,null,"NO",null,14,null,null,14,null,2029,null,null,null,15,null,"2016-01-15",null,null,null,0.15,"NO SATISFACTORIO",null,7,null,null,"UNO",2.2999999999999998,"NO SATISFACTORIO"]
[2003,null,null,null,15,null,null,15,null,2030,null,null,null,16,null,"2016-01-16",null,null,null,0.16,null,null,8,null,null,"UNO",15,"NO SATISFACTORIO"]
[2004,null,null,null,16,null,null,16,null,2031,null,null,null,17,null,"2016-01-17",null,"CONOCIMIENTO DEL ENTORNO",null,0.16,"NO SATISFACTORIO",5,9,null,null,"UNO",2.4,"NO SATISFACTORIO"]
[2085,null,null,null,17,null,null,17,null,2032,null,null,null,18,null,"2016-01-18",null,null,null,0.17,"NO SATISFACTORIO",5.9589041095890396,10,null,null,"UNO",2.5,"NO SATISFACTORIO"]
[2120,null,null,null,18,null,null,18,null,2033,null,null,null,19,null,"2016-01-19",null,"CONSTRUCCIÓN DE RELACIONES",null,0.18,"NO SATISFACTORIO",6.5068493150685001,11,null,null,"UNO",2.6,"NO SATISFACTORIO"]
[2142,null,null,null,19,null,null,19,null,2034,null,null,null,20,null,"2016-01-20",null,null,null,0.19,"NO SATISFACTORIO",7.0547945205479401,12,null,null,"UNO",2.7,"NO SATISFACTORIO"]
[2087,null,null,null,20,null,null,20,null,2035,null,null,null,21,null,"2016-01-21",null,null,null,0.2,"NO SATISFACTORIO",7.6027397260273899,13,null,null,"UNO",2.8,"NO SATISFACTORIO"]
[2123,null,null,null,21,null,null,21,null,2036,null,null,null,22,null,"2016-01-22",null,"INICIATIVA",null,0.21,"NO SATISFACTORIO",8.1506849315068504,14,null,null,"UNO",2.9,"NO SATISFACTORIO"]
[2052,null,null,null,22,null,null,22,null,2037,null,null,null,23,null,"2016-01-23",null,null,null,0.22,"NO SATISFACTORIO",8.6986301369862993,15,null,null,"UNO",3,"NO SATISFACTORIO"]
[2009,null,null,null,23,null,null,23,null,2038,null,null,null,24,null,"2016-01-24",null,null,null,0.23,"NO SATISFACTORIO",9.24657534246575,16,null,null,"UNO",3.1,"NO SATISFACTORIO"]
[2007,null,null,null,24,null,null,24,null,2039,null,65,null,25,null,"2016-01-25",null,null,null,0.24,"NO SATISFACTORIO",9.7945205479452007,17,null,null,"UNO",3.2,"NO SATISFACTORIO"]
[2112,null,null,null,25,null,null,25,null,2040,null,76,null,26,null,"2016-01-26",null,null,null,0.25,"NO SATISFACTORIO",10.342465753424699,18,null,null,"UNO",3.3,"NO SATISFACTORIO"]
[2165,null,null,null,26,null,null,26,null,2042,null,80,null,27,null,"2016-01-27",null,null,null,0.26,"NO SATISFACTORIO",10.8904109589041,19,null,null,"UNO",3.3,"NO SATISFACTORIO"]
[2028,null,null,null,27,null,null,27,null,2043,null,85,null,28,null,"2016-01-28",null,null,null,0.27,"NO SATISFACTORIO",11.438356164383601,20,null,null,"DOS",3.4,"NO SATISFACTORIO"]
[2033,null,null,null,null,null,null,28,null,2044,null,90,null,29,null,"2016-01-29",null,null,null,0.28000000000000003,"NO SATISFACTORIO",11.986301369863,21,null,null,null,3.5,"NO SATISFACTORIO"]
[2044,null,null,null,null,null,null,29,null,2045,null,95,null,30,null,"2016-01-30",null,null,null,0.28999999999999998,"NO SATISFACTORIO",12.534246575342401,22,null,null,null,3.6,"NO SATISFACTORIO"]
[2048,null,null,null,null,null,null,30,null,2046,null,100,null,31,null,"2016-01-31",null,null,null,0.3,"NO SATISFACTORIO",13.082191780821899,23,null,null,null,3.7,"NO SATISFACTORIO"]
[2152,null,null,null,null,null,null,31,null,2047,null,null,null,32,null,"2016-02-01",null,null,null,0.31,"NO SATISFACTORIO",13.6301369863013,24,null,null,null,3.8,"NO SATISFACTORIO"]
[2184,null,null,null,null,null,null,null,null,2048,null,null,null,33,null,"2016-02-02",null,null,null,0.32,"NO SATISFACTORIO",14.178082191780801,25,null,null,null,3.9,"NO SATISFACTORIO"]
[2094,null,null,null,null,null,null,null,null,2049,null,null,null,34,null,"2016-02-03",null,null,null,0.33,"NO SATISFACTORIO",14.7260273972603,26,null,null,null,4,"NO SATISFACTORIO"]
[2186,null,null,null,null,null,null,null,null,2050,null,null,null,35,null,"2016-02-04",null,null,null,0.34,"NO SATISFACTORIO",15.2739726027397,27,null,null,null,4.0999999999999996,"NO SATISFACTORIO"]
[2102,null,null,null,null,null,null,null,null,null,null,null,null,36,null,"2016-02-05",null,null,null,0.35,"NO SATISFACTORIO",15.821917808219199,28,null,null,null,4.2,"NO SATISFACTORIO"]
[2103,null,null,null,null,null,null,null,null,null,null,null,null,37,null,"2016-02-06",null,null,null,0.36,"NO SATISFACTORIO",16.369863013698598,29,null,null,null,4.3,"NO SATISFACTORIO"]
[2114,null,null,null,null,null,null,null,null,null,null,null,null,38,null,"2016-02-07",null,null,null,0.37,"NO SATISFACTORIO",16.917808219178099,30,null,null,null,4.4000000000000004,"NO SATISFACTORIO"]
[2147,null,null,null,null,null,null,null,null,null,null,null,null,39,null,"2016-02-08",null,null,null,0.38,"NO SATISFACTORIO",17.4657534246575,31,null,null,null,4.5,"NO SATISFACTORIO"]
[2116,null,null,null,null,null,null,null,null,null,null,null,null,40,null,"2016-02-09",null,null,null,0.39,"NO SATISFACTORIO",18.013698630137,32,null,null,null,4.5999999999999996,"NO SATISFACTORIO"]
[3003,null,null,null,null,null,null,null,null,null,null,null,null,41,null,"2016-02-10",null,null,null,0.4,"NO SATISFACTORIO",18.561643835616401,33,null,null,null,4.7,"NO SATISFACTORIO"]
[3038,null,null,null,null,null,null,null,null,null,null,null,null,42,null,"2016-02-11",null,null,null,0.41,"NO SATISFACTORIO",19.109589041095902,34,null,null,null,4.8,"NO SATISFACTORIO"]
[3046,null,null,null,null,null,null,null,null,null,null,null,null,43,null,"2016-02-12",null,null,null,0.42,"NO SATISFACTORIO",19.657534246575299,35,null,null,null,4.9000000000000004,"NO SATISFACTORIO"]
[3054,null,null,null,null,null,null,null,null,null,null,null,null,44,null,"2016-02-13",null,null,null,0.43,"NO SATISFACTORIO",20.205479452054799,36,null,null,null,5,"NO SATISFACTORIO"]
[3066,null,null,null,null,null,null,null,null,null,null,null,null,45,null,"2016-02-14",null,null,null,0.44,"NO SATISFACTORIO",20.7534246575342,37,null,null,null,5.0999999999999996,"NO SATISFACTORIO"]
[3066,null,null,null,null,null,null,null,null,null,null,null,null,46,null,"2016-02-15",null,null,null,0.45,"NO SATISFACTORIO",21.301369863013701,38,null,null,null,5.6,"NO SATISFACTORIO"]
[3074,null,null,null,null,null,null,null,null,null,null,null,null,47,null,"2016-02-16",null,null,null,0.46,"NO SATISFACTORIO",21.849315068493102,39,null,null,null,5.7,"NO SATISFACTORIO"]
[3078,null,null,null,null,null,null,null,null,null,null,null,null,48,null,"2016-02-17",null,null,null,0.47,"NO SATISFACTORIO",22.397260273972599,40,null,null,null,5.8,"NO SATISFACTORIO"]
[3080,null,null,null,null,null,null,null,null,null,null,null,null,49,null,"2016-02-18",null,null,null,0.48,"NO SATISFACTORIO",22.945205479452,41,null,null,null,5.9,"NO SATISFACTORIO"]
[3084,null,null,null,null,null,null,null,null,null,null,null,null,50,null,"2016-02-19",null,null,null,0.49,"NO SATISFACTORIO",23.4931506849315,42,null,null,null,6,"NO SATISFACTORIO"]
[3092,null,null,null,null,null,null,null,null,null,null,null,null,51,null,"2016-02-20",null,null,null,0.5,"NO SATISFACTORIO",24.041095890410901,43,null,null,null,6.1,"NO SATISFACTORIO"]
[3094,null,null,null,null,null,null,null,null,null,null,null,null,52,null,"2016-02-21",null,null,null,0.51,"NO SATISFACTORIO",24.589041095890401,44,null,null,null,6.2,"NO SATISFACTORIO"]
[3070,null,null,null,null,null,null,null,null,null,null,null,null,53,null,"2016-02-22",null,null,null,0.52,"NO SATISFACTORIO",null,45,null,null,null,6.3,"NO SATISFACTORIO"]
[3102,null,null,null,null,null,null,null,null,null,null,null,null,54,null,"2016-02-23",null,null,null,0.53,"NO SATISFACTORIO",null,46,null,null,"TRES",6.4,"NO SATISFACTORIO"]
[3105,null,null,null,null,null,null,null,null,null,null,null,null,55,null,"2016-02-24",null,null,null,0.54,"NO SATISFACTORIO",null,47,null,null,null,6.5,"NO SATISFACTORIO"]
[3110,null,null,null,null,null,null,null,null,null,null,null,null,56,null,"2016-02-25",null,null,null,0.55000000000000004,"NO SATISFACTORIO",null,48,null,null,null,6.6,"NO SATISFACTORIO"]
[3116,null,null,null,null,null,null,null,null,null,null,null,null,57,null,"2016-02-26",null,null,null,0.56000000000000005,"NO SATISFACTORIO",null,49,null,null,null,6.7,"NO SATISFACTORIO"]
[3118,null,null,null,null,null,null,null,null,null,null,null,null,58,null,"2016-02-27",null,null,null,0.56999999999999995,"NO SATISFACTORIO",null,50,null,null,null,6.8,"NO SATISFACTORIO"]
[3100,null,null,null,null,null,null,null,null,null,null,null,null,59,null,"2016-02-28",null,null,null,0.57999999999999996,"NO SATISFACTORIO",null,51,null,null,null,6.9,"NO SATISFACTORIO"]
[3124,null,null,null,null,null,null,null,null,null,null,null,null,60,null,"2016-02-29",null,null,null,0.59,"NO SATISFACTORIO",null,52,null,null,null,7,"NO SATISFACTORIO"]
[3234,null,null,null,null,null,null,null,null,null,null,null,null,61,null,"2016-03-01",null,null,null,0.6,"NO SATISFACTORIO",null,53,null,null,null,7.1,"NO SATISFACTORIO"]
[3128,null,null,null,null,null,null,null,null,null,null,null,null,62,null,"2016-03-02",null,null,null,0.61,"NO SATISFACTORIO",null,54,null,null,null,7.2,"NO SATISFACTORIO"]
[3132,null,null,null,null,null,null,null,null,null,null,null,null,63,null,"2016-03-03",null,null,null,0.62,"NO SATISFACTORIO",null,55,null,null,null,7.3,"NO SATISFACTORIO"]
[3136,null,null,null,null,null,null,null,null,null,null,null,null,64,null,"2016-03-04",null,null,null,0.63,"NO SATISFACTORIO",null,56,null,null,null,7.4,"NO SATISFACTORIO"]
[3142,null,null,null,null,null,null,null,null,null,null,null,null,65,null,"2016-03-05",null,null,null,0.64,"NO SATISFACTORIO",null,57,null,null,null,7.5,"NO SATISFACTORIO"]
[3142,null,null,null,null,null,null,null,null,null,null,null,null,66,null,"2016-03-06",null,null,null,0.65010000000000001,"SATISFACTORIO",null,58,null,null,null,7.6,"NO SATISFACTORIO"]
[3142,null,null,null,null,null,null,null,null,null,null,null,null,67,null,"2016-03-07",null,null,null,0.66,"SATISFACTORIO",null,59,null,null,null,7.7,"NO SATISFACTORIO"]
[3142,null,null,null,null,null,null,null,null,null,null,null,null,68,null,"2016-03-08",null,null,null,0.67,"SATISFACTORIO",null,60,null,null,null,7.8,"NO SATISFACTORIO"]
[3142,null,null,null,null,null,null,null,null,null,null,null,null,69,null,"2016-03-09",null,null,null,0.68,"SATISFACTORIO",null,61,null,null,null,7.9,"NO SATISFACTORIO"]
[4002,null,null,null,null,null,null,null,null,null,null,null,null,70,null,"2016-03-10",null,null,null,0.69,"SATISFACTORIO",null,62,null,null,null,8,"NO SATISFACTORIO"]
[4006,null,null,null,null,null,null,null,null,null,null,null,null,71,null,"2016-03-11",null,null,null,0.7,"SATISFACTORIO",null,63,null,null,null,8.1,"NO SATISFACTORIO"]
[4008,null,null,null,null,null,null,null,null,null,null,null,null,72,null,"2016-03-12",null,null,null,0.71,"SATISFACTORIO",null,64,null,null,null,8.1999999999999993,"NO SATISFACTORIO"]
[4026,null,null,null,null,null,null,null,null,null,null,null,null,73,null,"2016-03-13",null,null,null,0.72,"SATISFACTORIO",null,65,null,null,null,8.3000000000000007,"NO SATISFACTORIO"]
[4028,null,null,null,null,null,null,null,null,null,null,null,null,74,null,"2016-03-14",null,null,null,0.73,"SATISFACTORIO",null,66,null,null,null,8.4,"NO SATISFACTORIO"]
[4032,null,null,null,null,null,null,null,null,null,null,null,null,75,null,"2016-03-15",null,null,null,0.74,"SATISFACTORIO",null,67,null,null,null,8.5,"NO SATISFACTORIO"]
[4034,null,null,null,null,null,null,null,null,null,null,null,null,76,null,"2016-03-16",null,null,null,0.75,"SATISFACTORIO",null,68,null,null,null,8.6,"NO SATISFACTORIO"]
[4036,null,null,null,null,null,null,null,null,null,null,null,null,77,null,"2016-03-17",null,null,null,0.76,"SATISFACTORIO",null,69,null,null,null,8.6999999999999993,"NO SATISFACTORIO"]
[4038,null,null,null,null,null,null,null,null,null,null,null,null,78,null,"2016-03-18",null,null,null,0.77,"SATISFACTORIO",null,70,null,null,null,8.9,"NO SATISFACTORIO"]
[4044,null,null,null,null,null,null,null,null,null,null,null,null,79,null,"2016-03-19",null,null,null,0.78,"SATISFACTORIO",null,71,null,null,null,9,"NO SATISFACTORIO"]
[4048,null,null,null,null,null,null,null,null,null,null,null,null,80,null,"2016-03-20",null,null,null,0.79,"SATISFACTORIO",null,72,null,null,"CUATRO",9.1,"NO SATISFACTORIO"]
[4056,null,null,null,null,null,null,null,null,null,null,null,null,81,null,"2016-03-21",null,null,null,0.8,"SATISFACTORIO",null,73,null,null,null,9.1999999999999993,"NO SATISFACTORIO"]
[4064,null,null,null,null,null,null,null,null,null,null,null,null,82,null,"2016-03-22",null,null,null,0.81,"SATISFACTORIO",null,74,null,null,null,9.3000000000000007,"NO SATISFACTORIO"]
[4069,null,null,null,null,null,null,null,null,null,null,null,null,83,null,"2016-03-23",null,null,null,0.82,"SATISFACTORIO",null,75,null,null,null,9.4,"NO SATISFACTORIO"]
[4078,null,null,null,null,null,null,null,null,null,null,null,null,84,null,"2016-03-24",null,null,null,0.83,"SATISFACTORIO",null,76,null,null,null,9.5,"NO SATISFACTORIO"]
[4097,null,null,null,null,null,null,null,null,null,null,null,null,85,null,"2016-03-25",null,null,null,0.84,"SATISFACTORIO",null,77,null,null,null,9.6,"NO SATISFACTORIO"]
[4097,null,null,null,null,null,null,null,null,null,null,null,null,86,null,"2016-03-26",null,null,null,0.85,"SATISFACTORIO",null,78,null,null,null,9.6999999999999993,"NO SATISFACTORIO"]
[4097,null,null,null,null,null,null,null,null,null,null,null,null,87,null,"2016-03-27",null,null,null,0.86,"SATISFACTORIO",null,79,null,null,null,9.8000000000000007,"NO SATISFACTORIO"]
[4097,null,null,null,null,null,null,null,null,null,null,null,null,88,null,"2016-03-28",null,null,null,0.87,"SATISFACTORIO",null,80,null,null,null,9.9,"NO SATISFACTORIO"]
[4097,null,null,null,null,null,null,null,null,null,null,null,null,89,null,"2016-03-29",null,null,null,0.88,"SATISFACTORIO",null,81,null,null,null,10,"NO SATISFACTORIO"]
[4103,null,null,null,null,null,null,null,null,null,null,null,null,90,null,"2016-03-30",null,null,null,0.89,"SATISFACTORIO",null,82,null,null,null,10.1,"NO SATISFACTORIO"]
[4112,null,null,null,null,null,null,null,null,null,null,null,null,91,null,"2016-03-31",null,null,null,0.9,"SATISFACTORIO",null,83,null,null,null,10.199999999999999,"NO SATISFACTORIO"]
[4114,null,null,null,null,null,null,null,null,null,null,null,null,92,null,"2016-04-01",null,null,null,0.91,"SATISFACTORIO",null,84,null,null,null,10.3,"NO SATISFACTORIO"]
[4123,null,null,null,null,null,null,null,null,null,null,null,null,93,null,"2016-04-02",null,null,null,0.93,"SATISFACTORIO",null,85,null,null,null,10.4,"NO SATISFACTORIO"]
[4128,null,null,null,null,null,null,null,null,null,null,null,null,94,null,"2016-04-03",null,null,null,0.94,"SATISFACTORIO",null,86,null,null,null,10.5,"NO SATISFACTORIO"]
[4137,null,null,null,null,null,null,null,null,null,null,null,null,95,null,"2016-04-04",null,null,null,0.95,"SOBRESALIENTE",null,87,null,null,null,10.6,"NO SATISFACTORIO"]
[4152,null,null,null,null,null,null,null,null,null,null,null,null,96,null,"2016-04-05",null,null,null,0.96,"SOBRESALIENTE",null,88,null,null,null,10.7,"NO SATISFACTORIO"]
[4158,null,null,null,null,null,null,null,null,null,null,null,null,97,null,"2016-04-06",null,null,null,0.97,"SOBRESALIENTE",null,89,null,null,null,10.8,"NO SATISFACTORIO"]
[4167,null,null,null,null,null,null,null,null,null,null,null,null,98,null,"2016-04-07",null,null,null,0.98,"SOBRESALIENTE",null,90,null,null,null,10.9,"NO SATISFACTORIO"]
[4169,null,null,null,null,null,null,null,null,null,null,null,null,99,null,"2016-04-08",null,null,null,0.99,"SOBRESALIENTE",null,91,null,null,null,11,"NO SATISFACTORIO"]
[4173,null,null,null,null,null,null,null,null,null,null,null,null,100,null,"2016-04-09",null,null,null,1,"SOBRESALIENTE",null,92,null,null,null,11.1,"NO SATISFACTORIO"]
[4178,null,null,null,null,null,null,null,null,null,null,null,null,null,null,"2016-04-10",null,null,null,1.01,"SOBRESALIENTE",null,93,null,null,null,11.2,"NO SATISFACTORIO"]
[4182,null,null,null,null,null,null,null,null,null,null,null,null,0.98,null,"2016-04-11",null,null,null,null,null,null,94,null,null,null,11.3,"NO SATISFACTORIO"]
[4210,null,null,null,null,null,null,null,null,null,null,null,null,0.99,null,"2016-04-12",null,null,null,null,null,null,95,null,null,null,11.4,"NO SATISFACTORIO"]
[4212,null,null,null,null,null,null,null,null,null,null,null,null,1,null,"2016-04-13",null,null,null,null,null,null,96,null,null,null,11.5,"NO SATISFACTORIO"]
[4215,null,null,null,null,null,null,null,null,null,null,null,null,null,null,"2016-04-14",null,null,null,null,null,null,97,null,null,null,11.6,"NO SATISFACTORIO"]
[4220,null,null,null,null,null,null,null,null,null,null,null,null,null,null,"2016-04-15",null,null,null,null,null,null,98,null,null,"CINCO",11.7,"NO SATISFACTORIO"]
[4222,null,null,null,null,null,null,null,null,null,null,null,null,null,null,"2016-04-16",null,null,null,null,null,null,99,null,null,null,11.8,"NO SATISFACTORIO"]
[4225,null,null,null,null,null,null,null,null,null,null,null,null,null,null,"2016-04-17",null,null,null,null,null,null,100,null,null,null,11.9,"NO SATISFACTORIO"]
[4225,null,null,null,null,null,null,null,null,null,null,null,null,null,null,"2016-04-18",null,null,null,null,null,null,101,null,null,null,12,"NO SATISFACTORIO"]
[null,null,null,null,null,null,null,null,null,null,null,null,null,null,null,"2016-04-19",null,null,null,null,null,null,102,null,null,null,12.1,"NO SATISFACTORIO"]
[null,null,null,null,null,null,null,null,null,null,null,null,null,null,null,"2016-04-20",null,null,null,null,null,null,103,null,null,null,12.2,"NO SATISFACTORIO"]
["Agregado para Asuntos Aéreos",null,null,null,null,null,null,null,null,null,null,null,null,null,null,"2016-04-21",null,null,null,null,null,null,104,null,null,null,12.3,"NO SATISFACTORIO"]
["Asesor",null,null,null,null,null,null,null,null,null,null,null,null,null,null,"2016-04-22",null,null,null,null,null,null,105,null,null,null,12.4,"NO SATISFACTORIO"]
["Asesor Comercial",null,null,null,null,null,null,null,null,null,null,null,null,null,null,"2016-04-23",null,null,null,null,null,null,106,null,null,null,12.5,"NO SATISFACTORIO"]
["Jefe de Oficina Asesora de Comunicaciones o de Prensa o de Jurídica o de Planeación",null,null,null,null,null,null,null,null,null,null,null,null,null,null,"2016-04-24",null,null,null,null,null,null,107,null,null,null,12.6,"NO SATISFACTORIO"]
["Administrador de Parques Nacionales",null,null,null,null,null,null,null,null,null,null,null,null,null,null,"2016-04-25",null,null,null,null,null,null,108,null,null,null,12.7,"NO SATISFACTORIO"]
["Jefe de Área protegida",null,null,null,null,null,null,null,null,null,null,null,null,null,null,"2016-04-26",null,null,null,null,null,null,109,null,null,null,12.8,"NO SATISFACTORIO"]
["Capellán",null,null,null,null,null,null,null,null,null,null,null,null,null,null,"2016-04-27",null,null,null,null,null,null,110,null,null,null,12.9,"NO SATISFACTORIO"]
["Comandante Superior de Prisiones",null,null,null,null,null,null,null,null,null,null,null,null,null,null,"2016-04-28",null,null,null,null,null,null,111,null,null,null,13,"NO SATISFACTORIO"]
["Consejero de Relaciones Exteriores",null,null,null,null,null,null,null,null,null,null,null,null,null,null,"2016-04-29",null,null,null,null,null,null,112,null,null,null,13.1,"NO SATISFACTORIO"]
["Copiloto de Aviación",null,null,null,null,null,null,null,null,null,null,null,null,null,null,"2016-04-30",null,null,null,null,null,null,113,null,null,null,13.2,"NO SATISFACTORIO"]
["Defensor de Familia",null,null,null,null,null,null,null,null,null,null,null,null,null,null,"2016-05-01",null,null,null,null,null,null,114,null,null,null,13.3,"NO SATISFACTORIO"]
["Director de Establecimiento Carcelario",null,null,null,null,null,null,null,null,null,null,null,null,null,null,"2016-05-02",null,null,null,null,null,null,115,null,null,null,13.4,"NO SATISFACTORIO"]
["Especialista Asesor Primero",null,null,null,null,null,null,null,null,null,null,null,null,null,null,"2016-05-03",null,null,null,null,null,null,116,null,null,null,13.5,"NO SATISFACTORIO"]
["Especialista Jefe",null,null,null,null,null,null,null,null,null,null,null,null,null,null,"2016-05-04",null,null,null,null,null,null,117,null,null,null,13.6,"NO SATISFACTORIO"]
["Inspector de Trabajo y Seguridad Social",null,null,null,null,null,null,null,null,null,null,null,null,null,null,"2016-05-05",null,null,null,null,null,null,118,null,null,null,13.7,"NO SATISFACTORIO"]
["Inspector de Trabajo y Seguridad Social Especializado",null,null,null,null,null,null,null,null,null,null,null,null,null,null,"2016-05-06",null,null,null,null,null,null,119,null,null,null,13.8,"NO SATISFACTORIO"]
["Médico",null,null,null,null,null,null,null,null,null,null,null,null,null,null,"2016-05-07",null,null,null,null,null,null,120,null,null,null,13.9,"NO SATISFACTORIO"]
["Médico Especialista",null,null,null,null,null,null,null,null,null,null,null,null,null,null,"2016-05-08",null,null,null,null,null,null,121,null,null,null,14,"NO SATISFACTORIO"]
["Odontólogo",null,null,null,null,null,null,null,null,null,null,null,null,null,null,"2016-05-09",null,null,null,null,null,null,122,null,null,null,14.1,"NO SATISFACTORIO"]
["Odontólogo Especialista",null,null,null,null,null,null,null,null,null,null,null,null,null,null,"2016-05-10",null,null,null,null,null,null,123,null,null,null,14.2,"NO SATISFACTORIO"]
["Oficial Logístico",null,null,null,null,null,null,null,null,null,null,null,null,null,null,"2016-05-11",null,null,null,null,null,null,124,null,null,"SEIS",14.3,"NO SATISFACTORIO"]
["Oficial de Tratamiento Penitenciario",null,null,null,null,null,null,null,null,null,null,null,null,null,null,"2016-05-12",null,null,null,null,null,null,125,null,null,null,14.4,"NO SATISFACTORIO"]
["Pastor u Orientador Espiritual",null,null,null,null,null,null,null,null,null,null,null,null,null,null,"2016-05-13",null,null,null,null,null,null,126,null,null,null,14.5,"NO SATISFACTORIO"]
["Piloto de Aviación",null,null,null,null,null,null,null,null,null,null,null,null,null,null,"2016-05-14",null,null,null,null,null,null,127,null,null,null,14.6,"NO SATISFACTORIO"]
["Primer Secretario de Relaciones Exteriores",null,null,null,null,null,null,null,null,null,null,null,null,null,null,"2016-05-15",null,null,null,null,null,null,128,null,null,null,14.7,"NO SATISFACTORIO"]
["Profesional de Gestión Institucional",null,null,null,null,null,null,null,null,null,null,null,null,null,null,"2016-05-16",null,null,null,null,null,null,129,null,null,null,14.8,"NO SATISFACTORIO"]
["Profesional de Gestión Institucional",null,null,null,null,null,null,null,null,null,null,null,null,null,null,"2016-05-17",null,null,null,null,null,null,130,null,null,null,14.9,"NO SATISFACTORIO"]
["Profesional Especializado",null,null,null,null,null,null,null,null,null,null,null,null,null,null,"2016-05-18",null,null,null,null,null,null,131,null,null,null,15,"NO SATISFACTORIO"]
["Profesional Especializado Area de la Salud",null,null,null,null,null,null,null,null,null,null,null,null,null,null,"2016-05-19",null,null,null,null,null,null,132,null,null,null,15.1,"NO SATISFACTORIO"]
["Profesional Universitario",null,null,null,null,null,null,null,null,null,null,null,null,null,null,"2016-05-20",null,null,null,null,null,null,133,null,null,null,15.2,"NO SATISFACTORIO"]
["Profesional Universitario Area de la Salud",null,null,null,null,null,null,null,null,null,null,null,null,null,null,"2016-05-21",null,null,null,null,null,null,134,null,null,null,15.3,"NO SATISFACTORIO"]
["Registrador Delegado",null,null,null,null,null,null,null,null,null,null,null,null,null,null,"2016-05-22",null,null,null,null,null,null,135,null,null,null,15.4,"NO SATISFACTORIO"]
["Registrador Seccional",null,null,null,null,null,null,null,null,null,null,null,null,null,null,"2016-05-23",null,null,null,null,null,null,136,null,null,null,15.5,"NO SATISFACTORIO"]
["Representante del Ministro de Educación ante Entidad Territorial",null,null,null,null,null,null,null,null,null,null,null,null,null,null,"2016-05-24",null,null,null,null,null,null,137,null,null,null,15.6,"NO SATISFACTORIO"]
["Restaurador o Museólogo o Curador",null,null,null,null,null,null,null,null,null,null,null,null,null,null,"2016-05-25",null,null,null,null,null,null,138,null,null,null,15.7,"NO SATISFACTORIO"]
["Secretario de Facultad",null,null,null,null,null,null,null,null,null,null,null,null,null,null,"2016-05-26",null,null,null,null,null,null,139,null,null,null,15.8,"NO SATISFACTORIO"]
["Secretario Comercial I",null,null,null,null,null,null,null,null,null,null,null,null,null,null,"2016-05-27",null,null,null,null,null,null,140,null,null,null,15.9,"NO SATISFACTORIO"]
["Secretario Comercial II",null,null,null,null,null,null,null,null,null,null,null,null,null,null,"2016-05-28",null,null,null,null,null,null,141,null,null,null,16,"NO SATISFACTORIO"]
["Segundo Secretario de Relaciones Exteriores",null,null,null,null,null,null,null,null,null,null,null,null,null,null,"2016-05-29",null,null,null,null,null,null,142,null,null,null,16.100000000000001,"NO SATISFACTORIO"]
["Subdirector de Establecimiento Carcelario",null,null,null,null,null,null,null,null,null,null,null,null,null,null,"2016-05-30",null,null,null,null,null,null,143,null,null,null,16.2,"NO SATISFACTORIO"]
["Tercer Secretario de Relaciones Exteriores",null,null,null,null,null,null,null,null,null,null,null,null,null,null,"2016-05-31",null,null,null,null,null,null,144,null,null,null,16.3,"NO SATISFACTORIO"]
["Analista de Sistemas",null,null,null,null,null,null,null,null,null,null,null,null,null,null,"2016-06-01",null,null,null,null,null,null,145,null,null,null,16.399999999999999,"NO SATISFACTORIO"]
["Auxiliar de Escena",null,null,null,null,null,null,null,null,null,null,null,null,null,null,"2016-06-02",null,null,null,null,null,null,146,null,null,null,16.5,"NO SATISFACTORIO"]
["Auxiliar de Pronóstico",null,null,null,null,null,null,null,null,null,null,null,null,null,null,"2016-06-03",null,null,null,null,null,null,147,null,null,null,16.600000000000001,"NO SATISFACTORIO"]
["Auxiliar de Técnico",null,null,null,null,null,null,null,null,null,null,null,null,null,null,"2016-06-04",null,null,null,null,null,null,148,null,null,null,16.7,"NO SATISFACTORIO"]
["Dactiloscopista",null,null,null,null,null,null,null,null,null,null,null,null,null,null,"2016-06-05",null,null,null,null,null,null,149,null,null,null,16.8,"NO SATISFACTORIO"]
["Tecnico",null,null,null,null,null,null,null,null,null,null,null,null,null,null,"2016-06-06",null,null,null,null,null,null,150,null,null,"SIETE",16.899999999999999,"NO SATISFACTORIO"]
["Especialista Primero",null,null,null,null,null,null,null,null,null,null,null,null,null,null,"2016-06-07",null,null,null,null,null,null,151,null,null,null,17,"NO SATISFACTORIO"]
["Especialista Segundo",null,null,null,null,null,null,null,null,null,null,null,null,null,null,"2016-06-08",null,null,null,null,null,null,152,null,null,null,17.100000000000001,"NO SATISFACTORIO"]
["Especialista Tercero",null,null,null,null,null,null,null,null,null,null,null,null,null,null,"2016-06-09",null,null,null,null,null,null,153,null,null,null,17.2,"NO SATISFACTORIO"]
["Especialista Cuarto",null,null,null,null,null,null,null,null,null,null,null,null,null,null,"2016-06-10",null,null,null,null,null,null,154,null,null,null,17.3,"NO SATISFACTORIO"]
["Especialista Quinto",null,null,null,null,null,null,null,null,null,null,null,null,null,null,"2016-06-11",null,null,null,null,null,null,155,null,null,null,17.399999999999999,"NO SATISFACTORIO"]
["Especialista Sexto",null,null,null,null,null,null,null,null,null,null,null,null,null,null,"2016-06-12",null,null,null,null,null,null,156,null,null,null,17.5,"NO SATISFACTORIO"]
["Instructor",null,null,null,null,null,null,null,null,null,null,null,null,null,null,"2016-06-13",null,null,null,null,null,null,157,null,null,null,17.600000000000001,"NO SATISFACTORIO"]
["Instrumentador Quirúrgico",null,null,null,null,null,null,null,null,null,null,null,null,null,null,"2016-06-14",null,null,null,null,null,null,158,null,null,null,17.7,"NO SATISFACTORIO"]
["Observador de Superficie",null,null,null,null,null,null,null,null,null,null,null,null,null,null,"2016-06-15",null,null,null,null,null,null,159,null,null,null,17.8,"NO SATISFACTORIO"]
["Oficial de Catastro",null,null,null,null,null,null,null,null,null,null,null,null,null,null,"2016-06-16",null,null,null,null,null,null,160,null,null,null,17.899999999999999,"NO SATISFACTORIO"]
["Pronosticador",null,null,null,null,null,null,null,null,null,null,null,null,null,null,"2016-06-17",null,null,null,null,null,null,161,null,null,null,18,"NO SATISFACTORIO"]
["Radiosondista",null,null,null,null,null,null,null,null,null,null,null,null,null,null,"2016-06-18",null,null,null,null,null,null,162,null,null,null,18.100000000000001,"NO SATISFACTORIO"]
["Técnico",null,null,null,null,null,null,null,null,null,null,null,null,null,null,"2016-06-19",null,null,null,null,null,null,163,null,null,null,18.2,"NO SATISFACTORIO"]
["Técnico Administrativo",null,null,null,null,null,null,null,null,null,null,null,null,null,null,"2016-06-20",null,null,null,null,null,null,164,null,null,null,18.3,"NO SATISFACTORIO"]
["Técnico Area Salud",null,null,null,null,null,null,null,null,null,null,null,null,null,null,"2016-06-21",null,null,null,null,null,null,165,null,null,null,18.399999999999999,"NO SATISFACTORIO"]
["Técnico de Servicios Asistenciales",null,null,null,null,null,null,null,null,null,null,null,null,null,null,"2016-06-22",null,null,null,null,null,null,166,null,null,null,18.5,"NO SATISFACTORIO"]
["Técnico Operativo",null,null,null,null,null,null,null,null,null,null,null,null,null,null,"2016-06-23",null,null,null,null,null,null,167,null,null,null,18.600000000000001,"NO SATISFACTORIO"]
["Topógrafo",null,null,null,null,null,null,null,null,null,null,null,null,null,null,"2016-06-24",null,null,null,null,null,null,168,null,null,null,18.7,"NO SATISFACTORIO"]
["Topógrafo Tecnólogo",null,null,null,null,null,null,null,null,null,null,null,null,null,null,"2016-06-25",null,null,null,null,null,null,169,null,null,null,18.8,"NO SATISFACTORIO"]
["Adjunto Jefe",null,null,null,null,null,null,null,null,null,null,null,null,null,null,"2016-06-26",null,null,null,null,null,null,170,null,null,null,18.899999999999999,"NO SATISFACTORIO"]
["Adjunto Intendente",null,null,null,null,null,null,null,null,null,null,null,null,null,null,"2016-06-27",null,null,null,null,null,null,171,null,null,null,19,"NO SATISFACTORIO"]
["Adjunto Mayor",null,null,null,null,null,null,null,null,null,null,null,null,null,null,"2016-06-28",null,null,null,null,null,null,172,null,null,null,19.100000000000001,"NO SATISFACTORIO"]
["Adjunto Especial",null,null,null,null,null,null,null,null,null,null,null,null,null,null,"2016-06-29",null,null,null,null,null,null,173,null,null,null,19.2,"NO SATISFACTORIO"]
["Adjunto Primero",null,null,null,null,null,null,null,null,null,null,null,null,null,null,"2016-06-30",null,null,null,null,null,null,174,null,null,null,19.3,"NO SATISFACTORIO"]
["Adjunto Segundo",null,null,null,null,null,null,null,null,null,null,null,null,null,null,"2016-07-01",null,null,null,null,null,null,175,null,null,null,19.399999999999999,"NO SATISFACTORIO"]
["Adjunto Tercero",null,null,null,null,null,null,null,null,null,null,null,null,null,null,"2016-07-02",null,null,null,null,null,null,176,null,null,"OCHO",19.5,"NO SATISFACTORIO"]
["Adjunto Cuarto",null,null,null,null,null,null,null,null,null,null,null,null,null,null,"2016-07-03",null,null,null,null,null,null,177,null,null,null,19.600000000000001,"NO SATISFACTORIO"]
["Adjunto Quinto",null,null,null,null,null,null,null,null,null,null,null,null,null,null,"2016-07-04",null,null,null,null,null,null,178,null,null,null,19.7,"NO SATISFACTORIO"]
["Auxiliar Administrativo",null,null,null,null,null,null,null,null,null,null,null,null,null,null,"2016-07-05",null,null,null,null,null,null,179,null,null,null,19.8,"NO SATISFACTORIO"]
["Auxiliar Area Salud",null,null,null,null,null,null,null,null,null,null,null,null,null,null,"2016-07-06",null,null,null,null,null,null,180,null,null,null,19.899999999999999,"NO SATISFACTORIO"]
["Auxiliar Bilingüe",null,null,null,null,null,null,null,null,null,null,null,null,null,null,"2016-07-07",null,null,null,null,null,null,181,null,null,null,20,"NO SATISFACTORIO"]
["Auxiliar de Servicios Asistenciales",null,null,null,null,null,null,null,null,null,null,null,null,null,null,"2016-07-08",null,null,null,null,null,null,182,null,null,null,20.100000000000001,"NO SATISFACTORIO"]
["Auxiliar de Servicios Generales",null,null,null,null,null,null,null,null,null,null,null,null,null,null,"2016-07-09",null,null,null,null,null,null,183,null,null,null,20.2,"NO SATISFACTORIO"]
["Capitán de Prisiones",null,null,null,null,null,null,null,null,null,null,null,null,null,null,"2016-07-10",null,null,null,null,null,null,184,null,null,null,20.3,"NO SATISFACTORIO"]
["Celador",null,null,null,null,null,null,null,null,null,null,null,null,null,null,"2016-07-11",null,null,null,null,null,null,185,null,null,null,20.399999999999999,"NO SATISFACTORIO"]
["Asistencial",null,null,null,null,null,null,null,null,null,null,null,null,null,null,"2016-07-12",null,null,null,null,null,null,186,null,null,null,20.5,"NO SATISFACTORIO"]
["Conductor Mecánico",null,null,null,null,null,null,null,null,null,null,null,null,null,null,"2016-07-13",null,null,null,null,null,null,187,null,null,null,20.6,"NO SATISFACTORIO"]
["Distinguido",null,null,null,null,null,null,null,null,null,null,null,null,null,null,"2016-07-14",null,null,null,null,null,null,188,null,null,null,20.7,"NO SATISFACTORIO"]
["Dragoneante",null,null,null,null,null,null,null,null,null,null,null,null,null,null,"2016-07-15",null,null,null,null,null,null,189,null,null,null,20.8,"NO SATISFACTORIO"]
["Ecónomo",null,null,null,null,null,null,null,null,null,null,null,null,null,null,"2016-07-16",null,null,null,null,null,null,190,null,null,null,20.9,"NO SATISFACTORIO"]
["Enfermero Auxiliar",null,null,null,null,null,null,null,null,null,null,null,null,null,null,"2016-07-17",null,null,null,null,null,null,191,null,null,null,21,"NO SATISFACTORIO"]
["Inspector",null,null,null,null,null,null,null,null,null,null,null,null,null,null,"2016-07-18",null,null,null,null,null,null,192,null,null,null,21.1,"NO SATISFACTORIO"]
["Inspector Jefe",null,null,null,null,null,null,null,null,null,null,null,null,null,null,"2016-07-19",null,null,null,null,null,null,193,null,null,null,21.2,"NO SATISFACTORIO"]
["Mayor de Prisiones",null,null,null,null,null,null,null,null,null,null,null,null,null,null,"2016-07-20",null,null,null,null,null,null,194,null,null,null,21.3,"NO SATISFACTORIO"]
["Operario",null,null,null,null,null,null,null,null,null,null,null,null,null,null,"2016-07-21",null,null,null,null,null,null,195,null,null,null,21.4,"NO SATISFACTORIO"]
["Operario Calificado",null,null,null,null,null,null,null,null,null,null,null,null,null,null,"2016-07-22",null,null,null,null,null,null,196,null,null,null,21.5,"NO SATISFACTORIO"]
["Pagador",null,null,null,null,null,null,null,null,null,null,null,null,null,null,"2016-07-23",null,null,null,null,null,null,197,null,null,null,21.6,"NO SATISFACTORIO"]
["Secretario",null,null,null,null,null,null,null,null,null,null,null,null,null,null,"2016-07-24",null,null,null,null,null,null,198,null,null,null,21.7,"NO SATISFACTORIO"]
["Secretario Bilingüe",null,null,null,null,null,null,null,null,null,null,null,null,null,null,"2016-07-25",null,null,null,null,null,null,199,null,null,null,21.8,"NO SATISFACTORIO"]
["Secretario Ejecutivo",null,null,null,null,null,null,null,null,null,null,null,null,null,null,"2016-07-26",null,null,null,null,null,null,200,null,null,null,21.9,"NO SATISFACTORIO"]
["Secretario Ejecutivo del Despacho de Ministro o de Director de Departamento Administrativo",null,null,null,null,null,null,null,null,null,null,null,null,null,null,"2016-07-27",null,null,null,null,null,null,201,null,null,null,22,"NO SATISFACTORIO"]
["Secretario Ejecutivo del Despacho del Viceministro o de Subdirector de Departamento Administrativo",null,null,null,null,null,null,null,null,null,null,null,null,null,null,"2016-07-28",null,null,null,null,null,null,202,null,null,"NUEVE",22.1,"NO SATISFACTORIO"]
["Supervisor",null,null,null,null,null,null,null,null,null,null,null,null,null,null,"2016-07-29",null,null,null,null,null,null,203,null,null,null,22.2,"NO SATISFACTORIO"]
["Teniente de Prisiones",null,null,null,null,null,null,null,null,null,null,null,null,null,null,"2016-07-30",null,null,null,null,null,null,204,null,null,null,22.3,"NO SATISFACTORIO"]
["Tesorero",null,null,null,null,null,null,null,null,null,null,null,null,null,null,"2016-07-31",null,null,null,null,null,null,205,null,null,null,22.4,"NO SATISFACTORIO"]
[null,null,null,null,null,null,null,null,null,null,null,null,null,null,null,"2016-08-01",null,null,null,null,null,null,206,null,null,null,22.5,"NO SATISFACTORIO"]
[null,null,null,null,null,null,null,null,null,null,null,null,null,null,null,"2016-08-02",null,null,null,null,null,null,207,null,null,null,22.6,"NO SATISFACTORIO"]
[null,null,null,null,null,null,null,null,null,null,null,null,null,null,null,"2016-08-03",null,null,null,null,null,null,208,null,null,null,22.7,"NO SATISFACTORIO"]
[null,null,null,null,null,null,null,null,null,null,null,null,null,null,null,"2016-08-04",null,null,null,null,null,null,209,null,null,null,22.8,"NO SATISFACTORIO"]
["NIVEL","Competencia","Concatenar","Definición de la competencia","Conductas asociadas",null,null,null,null,null,null,null,null,null,null,null,"2016-08-05",null,null,null,null,null,null,210,null,null,null,22.9,"NO SATISFACTORIO"]
[null,null,null,null,null,null,null,null,null,null,null,null,null,null,null,null,"2016-08-06",null,null,null,null,null,null,211,null,null,null,23,"NO SATISFACTORIO"]
["ASESOR","Orientación a resultados ",{"$f":"A221&B221","v":"ASESOROrientación a resultados "},"Realizar las funciones y cumplir los compromisos organizacionales con eficacia y calidad. ","▪ Cumple con oportunidad en función de estándares, objetivos y metas establecidas por la entidad, las funciones que le son asignadas.\n▪ Asume la responsabilidad por sus resultados.\n▪ Compromete recursos y tiempos para mejorar la productividad tomando las medidas necesarias para minimizar los riesgos.\n▪ Realiza todas las acciones necesarias para alcanzar los objetivos propuestos enfrentando los obstáculos que se presentan.",null,null,"NIVEL","COMPETENCIA",null,null,null,null,null,null,null,"2016-08-07",null,null,null,null,null,null,212,null,null,null,23.1,"NO SATISFACTORIO"]
["ASESOR","Orientación al usuario y al ciudadano",{"$f":"A222&B222","v":"ASESOROrientación al usuario y al ciudadano"},"Dirigir las decisiones y acciones a la satisfacción de las necesidades e intereses de los usuarios internos y externos, de conformidad con las responsabilidades públicas asignadas a la entidad.","▪ Atiende y valora las necesidades y peticiones de los usuarios y de ciudadanos en general.\n▪Considera las necesidades de los usuarios al diseñar proyectos o servicios.\n▪Da respuesta oportuna a las necesidades de los usuarios de conformidad con el servicio que ofrece la entidad.\n▪Establece diferentes canales de comunicación con el usuario para conocer sus necesidades y propuestas y responde a las mismas.\n▪Reconoce la interdependencia entre su trabajo y el de otros.",null,null,"PROFESIONAL",null,null,null,null,null,null,null,null,"2016-08-08",null,null,null,null,null,null,213,null,null,null,23.2,"NO SATISFACTORIO"]
["ASESOR","Compromiso con la Organización","ASESORCompromiso con la Organización","Alinear el propio comportamiento a las necesidades, prioridades y metas organizacionales.","▪Promueve las metas de la organización y respeta sus normas.\n▪Antepone las necesidades de la organización a sus propias necesidades.\n▪Apoya a la organización en situaciones difíciles.\n▪Demuestra sentido de pertenencia en todas sus actuaciones.",null,null,null,null,null,null,null,null,null,null,null,"2016-08-09",null,null,null,null,null,null,214,null,null,null,23.3,"NO SATISFACTORIO",null,"NIVEL","COMPETENCIA","DEFINICIÒN DE LA COMPETENCIA","CONDUCTAS ASOCIADAS"]
["ASESOR","Experticia profesional","ASESORExperticia profesional","Aplicar el conocimiento profesional","▪Orienta el desarrollo de proyectos especiales para el logro de resultados de la alta dirección.\n▪Aconseja y orienta la toma de decisiones en los temas que le han sido asignados.\n▪Asesora en materias propias de su campo de conocimiento, emitiendo conceptos, juicios o propuestas ajustados a lineamientos teóricos y técnicos.\n▪Se comunica de modo lógico, claro, efectivo y seguro.",null,null,null,null,null,null,null,null,null,null,null,"2016-08-10",null,null,null,null,null,null,215,null,null,null,23.4,"NO SATISFACTORIO",null,"ASESOR","Experticia","Aplicar el conocimiento profesional","▪Orienta el desarrollo de proyectos especiales para el logro de resultados de la alta dirección.\n▪Aconseja y orienta la toma de decisiones en los temas que le han sido asignados.\n▪Asesora en materias propias de su campo de conocimiento, emitiendo conceptos, juicios o propuestas ajustados a lineamientos teóricos y técnicos.\n▪Se comunica de modo lógico, claro, efectivo y seguro."]
["ASESOR","Conocimiento del entorno","ASESORConocimiento del entorno","Conocer e interpretar la organización, su funcionamiento y sus relaciones políticas y administrativas.","▪Comprende el entorno organizacional que enmarca las situaciones objeto de asesoría y lo toma como referente obligado para emitir juicios, conceptos o propuestas a desarrollar.\n▪Se informa permanentemente sobre políticas gubernamentales, problemas y demandas del entorno.",null,null,null,null,null,null,null,null,null,null,null,"2016-08-11",null,null,null,null,null,null,216,null,null,null,23.5,"NO SATISFACTORIO",null,"ASESOR","Conocimiento del entorno","Conocer e interpretar la organización, su funcionamiento y sus relaciones políticas y administrativas.","▪Comprende el entorno organizacional que enmarca las situaciones objeto de asesoría y lo toma como referente obligado para emitir juicios, conceptos o propuestas a desarrollar.\n▪Se informa permanentemente sobre políticas gubernamentales, problemas y demandas del entorno."]
["ASESOR","Construcción de relaciones","ASESORConstrucción de relaciones","Establecer y mantener relaciones cordiales y recíprocas con redes o grupos de personas internas y externas a la organización que faciliten la consecución de los objetivos institucionales.","▪Utiliza sus contactos para conseguir objetivos.\n▪Comparte información para establecer lazos.\n▪Interactúa con otros de un modo efectivo y adecuado.",null,null,null,null,null,null,null,null,null,null,null,"2016-08-12",null,null,null,null,null,null,217,null,null,null,23.6,"NO SATISFACTORIO",null,"ASESOR","Construcción de relaciones","Establecer y mantener relaciones cordiales y recíprocas con redes o grupos de personas internas y externas a la organización que faciliten la consecución de los objetivos institucionales.","▪Utiliza sus contactos para conseguir objetivos.\n▪Comparte información para establecer lazos.\n▪Interactúa con otros de un modo efectivo y adecuado."]
["ASESOR","Iniciativa","ASESORIniciativa","Anticiparse a los problemas iniciando acciones para superar los obstáculos y alcanzar metas concretas","▪Prevé situaciones y alternativas de solución que orientan la toma de decisiones de la alta dirección.\n▪Enfrenta los problemas y propone acciones concretas para solucionarlos.\n▪Reconoce y hace viables las oportunidades.",null,null,null,null,null,null,null,null,null,null,null,"2016-08-13",null,null,null,null,null,null,218,null,null,null,23.7,"NO SATISFACTORIO",null,"ASESOR","Iniciativa","Anticiparse a los problemas iniciando acciones para superar los obstáculos y alcanzar metas concretas","▪Prevé situaciones y alternativas de solución que orientan la toma de decisiones de la alta dirección.\n▪Enfrenta los problemas y propone acciones concretas para solucionarlos.\n▪Reconoce y hace viables las oportunidades."]
["PROFESIONAL","Orientación a resultados ","PROFESIONALOrientación a resultados ","Realizar las funciones y cumplir los compromisos organizacionales con eficacia y calidad. ","▪ Cumple con oportunidad en función de estándares, objetivos y metas establecidas por la entidad, las funciones que le son asignadas.\n▪ Asume la responsabilidad por sus resultados.\n▪ Compromete recursos y tiempos para mejorar la productividad tomando las medidas necesarias para minimizar los riesgos.\n▪ Realiza todas las acciones necesarias para alcanzar los objetivos propuestos enfrentando los obstáculos que se presentan.",null,null,"NIVEL","COMPETENCIA",null,null,null,null,null,null,null,"2016-08-07",null,null,null,null,null,null,212,null,null,null,23.1,"NO SATISFACTORIO"]
["PROFESIONAL","Orientación al usuario y al ciudadano","PROFESIONALOrientación al usuario y al ciudadano","Dirigir las decisiones y acciones a la satisfacción de las necesidades e intereses de los usuarios internos y externos, de conformidad con las responsabilidades públicas asignadas a la entidad.","▪ Atiende y valora las necesidades y peticiones de los usuarios y de ciudadanos en general.\n▪Considera las necesidades de los usuarios al diseñar proyectos o servicios.\n▪Da respuesta oportuna a las necesidades de los usuarios de conformidad con el servicio que ofrece la entidad.\n▪Establece diferentes canales de comunicación con el usuario para conocer sus necesidades y propuestas y responde a las mismas.\n▪Reconoce la interdependencia entre su trabajo y el de otros.",null,null,"ASESOR",null,null,null,null,null,null,null,null,"2016-08-08",null,null,null,null,null,null,213,null,null,null,23.2,"NO SATISFACTORIO"]
["PROFESIONAL","Compromiso con la Organización","PROFESIONALCompromiso con la Organización","Alinear el propio comportamiento a las necesidades, prioridades y metas organizacionales.","▪Promueve las metas de la organización y respeta sus normas.\n▪Antepone las necesidades de la organización a sus propias necesidades.\n▪Apoya a la organización en situaciones difíciles.\n▪Demuestra sentido de pertenencia en todas sus actuaciones.",null,null,null,null,null,null,null,null,null,null,null,"2016-08-09",null,null,null,null,null,null,214,null,null,null,23.3,"NO SATISFACTORIO",null,"NIVEL","COMPETENCIA","DEFINICIÒN DE LA COMPETENCIA","CONDUCTAS ASOCIADAS"]
["PROFESIONAL","Aprendizaje Continuo","PROFESIONALAprendizaje Continuo","Adquirir y desarrollar permanentemente conocimientos, destrezas y habilidades, con el fin de mantener altos estándares de eficacia organizacional.","▪Aprende de la experiencia de otros y de la propia.\n▪Se adapta y aplica nuevas tecnologías que se implanten en la organización.\n▪Aplica los conocimientos adquiridos a los desafíos que se presentan en el desarrollo del trabajo.\n▪Investiga, indaga y profundiza en los temas de su entorno área de desempeño.\n▪Reconoce las propias limitaciones y las necesidades de mejorar su preparación.\n▪Asimila nueva información y la aplica correctamente.",null,null,null,null,null,null,null,null,null,null,null,"2016-08-14",null,null,null,null,null,null,219,null,null,null,23.8,"NO SATISFACTORIO",null,"ASESOR","Orientación a resultados ","Realizar las funciones y cumplir los compromisos organizacionales con eficacia y calidad. ","▪ Cumple con oportunidad en función de estándares, objetivos y metas establecidas por la entidad, las funciones que le son asignadas.\n▪ Asume la responsabilidad por sus resultados.\n▪ Compromete recursos y tiempos para mejorar la productividad tomando las medidas necesarias para minimizar los riesgos.\n▪ Realiza todas las acciones necesarias para alcanzar los objetivos propuestos enfrentando los obstáculos que se presentan."]
["PROFESIONAL","Experticia profesional","PROFESIONALExperticia profesional","Aplicar el conocimiento profesional en la resolución de problemas y transferirlo a su entorno laboral.","▪Analiza de un modo sistemático y racional los aspectos del trabajo, basándose en la información relevante.\n▪Aplica reglas básicas y conceptos complejos aprendidos\n▪Identifica y reconoce con facilidad las causas de los problemas y sus soluciones.\n▪Clarifica datos o situaciones complejas.\n▪Planea, organiza y ejecuta múltiples tareas tendientes a alcanzar resultados institucionales.",null,null,null,null,null,null,null,null,null,null,null,"2016-08-15",null,null,null,null,null,null,220,null,null,null,23.9,"NO SATISFACTORIO",null,"ASESOR","Orientación al usuario y al ciudadano","Dirigir las decisiones y acciones a la satisfacción de las necesidades e intereses de los usuarios internos y externos, de conformidad con las responsabilidades públicas asignadas a la entidad.","▪ Atiende y valora las necesidades y peticiones de los usuarios y de ciudadanos en general.\n▪Considera las necesidades de los usuarios al diseñar proyectos o servicios.\n▪Da respuesta oportuna a las necesidades de los usuarios de conformidad con el servicio que ofrece la entidad.\n▪Establece diferentes canales de comunicación con el usuario para conocer sus necesidades y propuestas y responde a las mismas.\n▪Reconoce la interdependencia entre su trabajo y el de otros.\n"]
["PROFESIONAL","Trabajo en equipo y Colaboración","PROFESIONALTrabajo en equipo y Colaboración","Trabajar con otros de forma conjunta y de manera participativa, integrando esfuerzos para la consecución de metas institucionales comunes.","▪Coopera en distintas situaciones y comparte información.\n▪Aporta sugerencias, ideas y opiniones.\n▪Expresa expectativas positivas del equipo o de los miembros del mismo.\n▪Planifica las propias acciones teniendo en cuenta la repercusión de las mismas para la consecución de los objetivos grupales.\n▪Establece diálogo directo con los miembros del equipo que permita compartir información e ideas en condiciones de respeto y cordialidad.\n▪Respeta criterios dispares y distintas opiniones del equipo.",null,null,null,null,null,null,null,null,null,null,null,"2016-08-16",null,null,null,null,null,null,221,null,null,null,24,"NO SATISFACTORIO",null,"ASESOR","Compromiso con la Organización","Alinear el propio comportamiento a las necesidades, prioridades y metas organizacionales.","▪Promueve las metas de la organización y respeta sus normas.\n▪Antepone las necesidades de la organización a sus propias necesidades.\n▪Apoya a la organización en situaciones difíciles.\n▪Demuestra sentido de pertenencia en todas sus actuaciones."]
["PROFESIONAL","Creatividad e Innovación","PROFESIONALCreatividad e Innovación","Generar y desarrollar nuevas ideas, conceptos, métodos y soluciones.","▪Ofrece respuestas alternativas.\n▪Aprovecha las oportunidades y problemas para dar soluciones novedosas.\n▪Desarrolla nuevas formas de hacer y tecnologías.\n▪Busca nuevas alternativas de solución y se arriesga a romper esquemas tradicionales.\n▪Inicia acciones para superar los obstáculos y alcanzar metas específicas.",null,null,null,null,null,null,null,null,null,null,null,"2016-08-17",null,null,null,null,null,null,222,null,null,null,24.1,"NO SATISFACTORIO",null,"PROFESIONAL","Aprendizaje Continuo","Adquirir y desarrollar permanentemente conocimientos, destrezas y habilidades, con el fin de mantener altos estándares de eficacia organizacional.","▪Aprende de la experiencia de otros y de la propia.\n▪Se adapta y aplica nuevas tecnologías que se implanten en la organización.\n▪Aplica los conocimientos adquiridos a los desafíos que se presentan en el desarrollo del trabajo.\n▪Investiga, indaga y profundiza en los temas de su entorno área de desempeño.\n▪Reconoce las propias limitaciones y las necesidades de mejorar su preparación.\n▪Asimila nueva información y la aplica correctamente."]
["PROFESIONAL","Liderazgo de Grupos de Trabajo (personal a cargo)","PROFESIONALLiderazgo de Grupos de Trabajo (personal a cargo)","Asumir el rol de orientar y guía de un grupo o equipo de trabajo, utilizando la autoridad con arreglo a las normas y promoviendo la Efectividad en la consecución de objetivos y metas institucionales.","▪Establece los objetivos del grupo de forma clara y equilibrada.\n▪Asegura que los integrantes del grupo compartan planes, programas y proyectos institucionales.\n▪Orienta y coordina el trabajo del grupo para la identificación de planes y actividades a seguir.\n▪Facilita la colaboración con otras áreas y dependencias.\n▪Escucha y tiene en cuenta las opiniones de los integrantes del grupo.\n▪Gestiona los recursos necesarios para poder cumplir con las metas propuestas.\n▪Garantiza los recursos necesarios para poder cumplir con las metas propuestas.\n▪Garantiza que el grupo tenga la información necesaria.\n▪Explica las razones de las decisiones.",null,null,null,null,null,null,null,null,null,null,null,"2016-08-18",null,null,null,null,null,null,223,null,null,null,24.2,"NO SATISFACTORIO",null,"PROFESIONAL","Experticia profesional","Aplicar el conocimiento profesional en la resolución de problemas y transferirlo a su entorno laboral.","▪Analiza de un modo sistemático y racional los aspectos del trabajo, basándose en la información relevante.\n▪Aplica reglas básicas y conceptos complejos aprendidos\n▪Identifica y reconoce con facilidad las causas de los problemas y sus soluciones.\n▪Clarifica datos o situaciones complejas.\n▪Planea, organiza y ejecuta múltiples tareas tendientes a alcanzar resultados institucionales.\n"]
["PROFESIONAL","Toma de decisiones (personal a cargo)","PROFESIONALToma de decisiones (personal a cargo)","Elegir entre una o varias alternativas para solucionar un problema y tomar las acciones concretas y consecuentes con la elección realizada.","▪Elige alternativas de solución efectiva y suficiente para atender los asuntos encomendados.\n▪Decide y establece prioridades para el trabajo del grupo.\n▪Asume posiciones concretas para el manejo de temas o situaciones que demandan su atención.\n▪Efectúa cambios en las actividades o en la manera de desarrollar sus responsabilidades cuando detecta dificultades para su realización o mejores prácticas que pueden optimizar el desempeño.\n▪Asume las consecuencias de las decisiones adoptadas.\n▪Fomenta la participación en la toma de decisiones.",null,null,null,null,null,null,null,null,null,null,null,"2016-08-19",null,null,null,null,null,null,224,null,null,null,24.3,"NO SATISFACTORIO",null,"PROFESIONAL","Trabajo en equipo y Colaboración","Trabajar con otros de forma conjunta y de manera participativa, integrando esfuerzos para la consecución de metas institucionales comunes.","▪Coopera en distintas situaciones y comparte información.\n▪Aporta sugerencias, ideas y opiniones.\n▪Expresa expectativas positivas del equipo o de los miembros del mismo.\n▪Planifica las propias acciones teniendo en cuenta la repercusión de las mismas para la consecución de los objetivos grupales.\n▪Establece diálogo directo con los miembros del equipo que permita compartir información e ideas en condiciones de respeto y cordialidad.\n▪Respeta criterios dispares y distintas opiniones del equipo."]
["TECNICO","Orientación a resultados ","TECNICOOrientación a resultados ","Realizar las funciones y cumplir los compromisos organizacionales con eficacia y calidad. ","▪ Cumple con oportunidad en función de estándares, objetivos y metas establecidas por la entidad, las funciones que le son asignadas.\n▪ Asume la responsabilidad por sus resultados.\n▪ Compromete recursos y tiempos para mejorar la productividad tomando las medidas necesarias para minimizar los riesgos.\n▪ Realiza todas las acciones necesarias para alcanzar los objetivos propuestos enfrentando los obstáculos que se presentan.",null,null,"NIVEL","COMPETENCIA",null,null,null,null,null,null,null,"2016-08-07",null,null,null,null,null,null,212,null,null,null,23.1,"NO SATISFACTORIO"]
["TECNICO","Orientación al usuario y al ciudadano","TECNICOOrientación al usuario y al ciudadano","Dirigir las decisiones y acciones a la satisfacción de las necesidades e intereses de los usuarios internos y externos, de conformidad con las responsabilidades públicas asignadas a la entidad.","▪ Atiende y valora las necesidades y peticiones de los usuarios y de ciudadanos en general.\n▪Considera las necesidades de los usuarios al diseñar proyectos o servicios.\n▪Da respuesta oportuna a las necesidades de los usuarios de conformidad con el servicio que ofrece la entidad.\n▪Establece diferentes canales de comunicación con el usuario para conocer sus necesidades y propuestas y responde a las mismas.\n▪Reconoce la interdependencia entre su trabajo y el de otros.",null,null,"ASESOR","Orientación a resultados ",null,null,null,null,null,null,null,"2016-08-08",null,null,null,null,null,null,213,null,null,null,23.2,"NO SATISFACTORIO"]
["TECNICO","Compromiso con la Organización","TECNICOCompromiso con la Organización","Alinear el propio comportamiento a las necesidades, prioridades y metas organizacionales.","▪Promueve las metas de la organización y respeta sus normas.\n▪Antepone las necesidades de la organización a sus propias necesidades.\n▪Apoya a la organización en situaciones difíciles.\n▪Demuestra sentido de pertenencia en todas sus actuaciones.",null,null,null,null,null,null,null,null,null,null,null,"2016-08-09",null,null,null,null,null,null,214,null,null,null,23.3,"NO SATISFACTORIO",null,"NIVEL","COMPETENCIA","DEFINICIÒN DE LA COMPETENCIA","CONDUCTAS ASOCIADAS"]
["TECNICO","Experticia Técnica","TECNICOExperticia Técnica","Entender y aplicar los conocimientos técnicos del área de desempeño y mantenerlos actualizados","▪Capta y asimila con facilidad conceptos e información.\n▪Aplica el conocimiento técnico a las actividades cotidianas.\n▪Analiza la información de acuerdo con las necesidades de la organización.\n▪Comprende los aspectos técnicos y los aplica al desarrollo de procesos y procedimientos en los que está involucrado.\n▪Resuelve problemas utilizando sus conocimientos técnicos de su especialidad y garantizando indicadores y estándares establecidos.",null,null,null,null,null,null,null,null,null,null,null,"2016-08-20",null,null,null,null,null,null,225,null,null,null,24.4,"NO SATISFACTORIO",null,"PROFESIONAL","Creatividad e Innovación","Generar y desarrollar nuevas ideas, conceptos, métodos y soluciones.","▪Ofrece respuestas alternativas.\n▪Aprovecha las oportunidades y problemas para dar soluciones novedosas.\n▪Desarrolla nuevas formas de hacer y tecnologías.\n▪Busca nuevas alternativas de solución y se arriesga a romper esquemas tradicionales.\n▪Inicia acciones para superar los obstáculos y alcanzar metas específicas."]
["TECNICO","Trabajo en equipo","TECNICOTrabajo en equipo","Trabajar con otros para conseguir metas comunes","▪Identifica claramente los objetivos del grupo y orienta su trabajo a la consecución de los mismos.\n▪Colabora con otros para la realización de actividades y metas grupales.",null,null,null,null,null,null,null,null,null,null,null,"2016-08-21",null,null,null,null,null,null,226,null,null,null,24.5,"NO SATISFACTORIO",null,"PROFESIONAL","Orientación a resultados ","Realizar las funciones y cumplir los compromisos organizacionales con eficacia y calidad. ","▪ Cumple con oportunidad en función de estándares, objetivos y metas establecidas por la entidad, las funciones que le son asignadas.\n▪ Asume la responsabilidad por sus resultados.\n▪ Compromete recursos y tiempos para mejorar la productividad tomando las medidas necesarias para minimizar los riesgos.\n▪ Realiza todas las acciones necesarias para alcanzar los objetivos propuestos enfrentando los obstáculos que se presentan."]
["TECNICO","Creatividad e innovación","TECNICOCreatividad e innovación","Presentar ideas y métodos novedosos y concretarlos en acciones","▪Propone y encuentra formas nuevas y eficaces de hacer las cosas.\n▪Es recursivo.\n▪Es práctico.\n▪Busca nuevas alternativas de solución.\n▪Revisa permanentemente los procesos y procedimientos para optimizar los resultados.",null,null,null,null,null,null,null,null,null,null,null,"2016-08-22",null,null,null,null,null,null,227,null,null,null,24.599999999999898,"NO SATISFACTORIO",null,"PROFESIONAL","Orientación al usuario y al ciudadano","Dirigir las decisiones y acciones a la satisfacción de las necesidades e intereses de los usuarios internos y externos, de conformidad con las responsabilidades públicas asignadas a la entidad.","▪ Atiende y valora las necesidades y peticiones de los usuarios y de ciudadanos en general.\n▪Considera las necesidades de los usuarios al diseñar proyectos o servicios.\n▪Da respuesta oportuna a las necesidades de los usuarios de conformidad con el servicio que ofrece la entidad.\n▪Establece diferentes canales de comunicación con el usuario para conocer sus necesidades y propuestas y responde a las mismas.\n▪Reconoce la interdependencia entre su trabajo y el de otros.\n"]
["ASISTENCIAL","Orientación a resultados ","ASISTENCIALOrientación a resultados ","Realizar las funciones y cumplir los compromisos organizacionales con eficacia y calidad. ","▪ Cumple con oportunidad en función de estándares, objetivos y metas establecidas por la entidad, las funciones que le son asignadas.\n▪ Asume la responsabilidad por sus resultados.\n▪ Compromete recursos y tiempos para mejorar la productividad tomando las medidas necesarias para minimizar los riesgos.\n▪ Realiza todas las acciones necesarias para alcanzar los objetivos propuestos enfrentando los obstáculos que se presentan.",null,null,"NIVEL","COMPETENCIA",null,null,null,null,null,null,null,"2016-08-07",null,null,null,null,null,null,212,null,null,null,23.1,"NO SATISFACTORIO"]
["ASISTENCIAL","Orientación al usuario y al ciudadano","ASISTENCIALOrientación al usuario y al ciudadano","Dirigir las decisiones y acciones a la satisfacción de las necesidades e intereses de los usuarios internos y externos, de conformidad con las responsabilidades públicas asignadas a la entidad.","▪ Atiende y valora las necesidades y peticiones de los usuarios y de ciudadanos en general.\n▪Considera las necesidades de los usuarios al diseñar proyectos o servicios.\n▪Da respuesta oportuna a las necesidades de los usuarios de conformidad con el servicio que ofrece la entidad.\n▪Establece diferentes canales de comunicación con el usuario para conocer sus necesidades y propuestas y responde a las mismas.\n▪Reconoce la interdependencia entre su trabajo y el de otros.",null,null,"ASESOR",null,null,null,null,null,null,null,null,"2016-08-08",null,null,null,null,null,null,213,null,null,null,23.2,"NO SATISFACTORIO"]
["ASISTENCIAL","Compromiso con la Organización","ASISTENCIALCompromiso con la Organización","Alinear el propio comportamiento a las necesidades, prioridades y metas organizacionales.","▪Promueve las metas de la organización y respeta sus normas.\n▪Antepone las necesidades de la organización a sus propias necesidades.\n▪Apoya a la organización en situaciones difíciles.\n▪Demuestra sentido de pertenencia en todas sus actuaciones.",null,null,null,null,null,null,null,null,null,null,null,"2016-08-09",null,null,null,null,null,null,214,null,null,null,23.3,"NO SATISFACTORIO",null,"NIVEL","COMPETENCIA","DEFINICIÒN DE LA COMPETENCIA","CONDUCTAS ASOCIADAS"]
["ASISTENCIAL","Manejo de la información","ASISTENCIALManejo de la información","Manejar con respeto las informaciones personales e institucionales de que dispone.","▪Evade temas que indagan sobre información confidencial.\n▪Recoge sólo información imprescindible para el desarrollo de la tarea.\n▪Organiza y guarda de forma adecuada la información a su cuidado, teniendo en cuenta las normas legales y de la organización.\n▪No hace pública información laboral o de las personas que pueda afectar la organización o las personas.",null,null,null,null,null,null,null,null,null,null,null,"2016-08-23",null,null,null,null,null,null,228,null,null,"DIEZ",24.6999999999999,"NO SATISFACTORIO",null,"PROFESIONAL","Compromiso con la Organización","Alinear el propio comportamiento a las necesidades, prioridades y metas organizacionales.","▪Promueve las metas de la organización y respeta sus normas.\n▪Antepone las necesidades de la organización a sus propias necesidades.\n▪Apoya a la organización en situaciones difíciles.\n▪Demuestra sentido de pertenencia en todas sus actuaciones."]
["ASISTENCIAL","Adaptación al cambio","ASISTENCIALAdaptación al cambio","Enfrentarse con flexibilidad y versatilidad a situaciones nuevas para aceptar los cambios positiva y constructivamente.","▪Acepta y se adapta fácilmente los cambios.\n▪Responde al cambio con flexibilidad.\n▪Promueve el cambio.",null,null,null,null,null,null,null,null,null,null,null,"2016-08-24",null,null,null,null,null,null,229,null,null,null,24.799999999999901,"NO SATISFACTORIO",null,"PROFESIONAL CON PERSONAL A CARGO","Aprendizaje Continuo","Adquirir y desarrollar permanentemente conocimientos, destrezas y habilidades, con el fin de mantener altos estándares de eficacia organizacional.","▪Aprende de la experiencia de otros y de la propia.\n▪Se adapta y aplica nuevas tecnologías que se implanten en la organización.\n▪Aplica los conocimientos adquiridos a los desafíos que se presentan en el desarrollo del trabajo.\n▪Investiga, indaga y profundiza en los temas de su entorno área de desempeño.\n▪Reconoce las propias limitaciones y las necesidades de mejorar su preparación.\n▪Asimila nueva información y la aplica correctamente."]
["ASISTENCIAL","Disciplina","ASISTENCIALDisciplina","Adaptarse a las políticas institucionales y buscar información de los cambios en la autoridad competente.","▪Acepta instrucciones aunque se difiera de ellas.\n▪Realiza los cometidos y tareas del puesto de trabajo.\n▪Acepta la supervisión constante.\n▪Realiza funciones orientadas a apoyar la acción de otros miembros de la organización.",null,null,null,null,null,null,null,null,null,null,null,"2016-08-25",null,null,null,null,null,null,230,null,null,null,24.899999999999899,"NO SATISFACTORIO",null,"PROFESIONAL CON PERSONAL A CARGO","Experticia profesional","Aplicar el conocimiento profesional en la resolución de problemas y transferirlo a su entorno laboral.","▪Analiza de un modo sistemático y racional los aspectos del trabajo, basándose en la información relevante.\n▪Aplica reglas básicas y conceptos complejos aprendidos\n▪Identifica y reconoce con facilidad las causas de los problemas y sus soluciones.\n▪Clarifica datos o situaciones complejas.\n▪Planea, organiza y ejecuta múltiples tareas tendientes a alcanzar resultados institucionales.\n"]
["ASISTENCIAL","Relaciones Interpersonales","ASISTENCIALRelaciones Interpersonales","Establecer y mantener relaciones de trabajo amistosas y positivas, basadas en la comunicación abierta y fluida y en el respeto por los demás.","▪Escucha con interés a las personas y capta las preocupaciones, intereses y necesidades de los demás.\n▪Transmite eficazmente las ideas, sentimientos e información impidiendo con ello malos entendidos o situaciones confusas que puedan generar conflictos.",null,null,null,null,null,null,null,null,null,null,null,"2016-08-26",null,null,null,null,null,null,231,null,null,null,24.999999999999901,"NO SATISFACTORIO",null,"PROFESIONAL CON PERSONAL A CARGO","Trabajo en equipo y Colaboración","Trabajar con otros de forma conjunta y de manera participativa, integrando esfuerzos para la consecución de metas institucionales comunes.","▪Coopera en distintas situaciones y comparte información.\n▪Aporta sugerencias, ideas y opiniones.\n▪Expresa expectativas positivas del equipo o de los miembros del mismo.\n▪Planifica las propias acciones teniendo en cuenta la repercusión de las mismas para la consecución de los objetivos grupales.\n▪Establece diálogo directo con los miembros del equipo que permita compartir información e ideas en condiciones de respeto y cordialidad.\n▪Respeta criterios dispares y distintas opiniones del equipo."]
["ASISTENCIAL","Colaboración","ASISTENCIALColaboración","Cooperar con los demás con el fin de alcanzar los objetivos institucionales","▪Ayuda al logro de los objetivos articulando sus actuaciones con los demás.\n▪Cumple los compromisos que adquiere.\n▪Facilita la labor de sus superiores y compañeros de trabajo.",null,null,null,null,null,null,null,null,null,null,null,"2016-08-27",null,null,null,null,null,null,232,null,null,null,25.099999999999898,"NO SATISFACTORIO",null,"PROFESIONAL CON PERSONAL A CARGO","Creatividad e Innovación","Generar y desarrollar nuevas ideas, conceptos, métodos y soluciones.","▪Ofrece respuestas alternativas.\n▪Aprovecha las oportunidades y problemas para dar soluciones novedosas.\n▪Desarrolla nuevas formas de hacer y tecnologías.\n▪Busca nuevas alternativas de solución y se arriesga a romper esquemas tradicionales.\n▪Inicia acciones para superar los obstáculos y alcanzar metas específicas."]
[null,null,null,null,null,null,null,null,null,null,null,null,null,null,null,"2016-08-28",null,null,null,null,null,null,233,null,null,null,25.1999999999999,"NO SATISFACTORIO",null,"PROFESIONAL CON PERSONAL A CARGO","Orientación a resultados ","Realizar las funciones y cumplir los compromisos organizacionales con eficacia y calidad. ","▪ Cumple con oportunidad en función de estándares, objetivos y metas establecidas por la entidad, las funciones que le son asignadas.\n▪ Asume la responsabilidad por sus resultados.\n▪ Compromete recursos y tiempos para mejorar la productividad tomando las medidas necesarias para minimizar los riesgos.\n▪ Realiza todas las acciones necesarias para alcanzar los objetivos propuestos enfrentando los obstáculos que se presentan."]
[null,null,null,null,null,null,null,null,null,null,null,null,null,null,null,"2016-08-29",null,null,null,null,null,null,234,null,null,null,25.299999999999901,"NO SATISFACTORIO",null,"PROFESIONAL CON PERSONAL A CARGO","Orientación al usuario y al ciudadano","Dirigir las decisiones y acciones a la satisfacción de las necesidades e intereses de los usuarios internos y externos, de conformidad con las responsabilidades públicas asignadas a la entidad.","▪ Atiende y valora las necesidades y peticiones de los usuarios y de ciudadanos en general.\n▪Considera las necesidades de los usuarios al diseñar proyectos o servicios.\n▪Da respuesta oportuna a las necesidades de los usuarios de conformidad con el servicio que ofrece la entidad.\n▪Establece diferentes canales de comunicación con el usuario para conocer sus necesidades y propuestas y responde a las mismas.\n▪Reconoce la interdependencia entre su trabajo y el de otros.\n"]
["NIVELES DE PROFUNDIZACION DE LA COMPETENCIAS","RESULTADOS CUANTITATIVOS",null,null,null,null,"RESULTADOS CUANTITATIVOS",null,null,null,null,null,null,null,null,"2016-08-30",null,null,null,null,null,null,235,null,null,null,25.399999999999899,"NO SATISFACTORIO",null,"PROFESIONAL CON PERSONAL A CARGO","Compromiso con la Organización","Alinear el propio comportamiento a las necesidades, prioridades y metas organizacionales.","▪Promueve las metas de la organización y respeta sus normas.\n▪Antepone las necesidades de la organización a sus propias necesidades.\n▪Apoya a la organización en situaciones difíciles.\n▪Demuestra sentido de pertenencia en todas sus actuaciones."]
["NO EVALUADO",0,null,null,null,null,null,null,null,null,null,null,null,null,null,"2016-08-31",null,null,null,null,null,null,236,null,null,null,25.499999999999901,"NO SATISFACTORIO",null,"PROFESIONAL CON PERSONAL A CARGO","Liderazgo de Grupos de Trabajo","Asumir el rol de orientar y guía de un grupo o equipo de trabajo, utilizando la autoridad con arreglo a las normas y promoviendo la Efectividad en la consecución de objetivos y metas institucionales.","▪Establece los objetivos del grupo de forma clara y equilibrada.\n▪Asegura que los integrantes del grupo compartan planes, programas y proyectos institucionales.\n▪Orienta y coordina el trabajo del grupo para la identificación de planes y actividades a seguir.\n▪Facilita la colaboración con otras áreas y dependencias.\n▪Escucha y tiene en cuenta las opiniones de los integrantes del grupo.\n▪Gestiona los recursos necesarios para poder cumplir con las metas propuestas.\n▪Garantiza los recursos necesarios para poder cumplir con las metas propuestas.\n▪Garantiza que el grupo tenga la información necesaria.\n▪Explica las razones de las decisiones."]
["BAJO",4,null,null,null,null,4,null,null,null,null,null,null,null,null,"2016-09-01",null,null,null,null,null,null,237,null,null,null,25.599999999999898,"NO SATISFACTORIO",null,"PROFESIONAL CON PERSONAL A CARGO","Toma de decisiones","Elegir entre una o varias alternativas para solucionar un problema y tomar las acciones concretas y consecuentes con la elección realizada.","▪Elige alternativas de solución efectiva y suficiente para atender los asuntos encomendados.\n▪Decide y establece prioridades para el trabajo del grupo.\n▪Asume posiciones concretas para el manejo de temas o situaciones que demandan su atención.\n▪Efectúa cambios en las actividades o en la manera de desarrollar sus responsabilidades cuando detecta dificultades para su realización o mejores prácticas que pueden optimizar el desempeño.\n▪Asume las consecuencias de las decisiones adoptadas.\n▪Fomenta la participación en la toma de decisiones."]
["ACEPTABLE",6,5,null,null,null,6,null,null,null,null,null,null,null,null,"2016-09-02",null,null,null,null,null,null,238,null,null,null,25.6999999999999,"NO SATISFACTORIO",null,"PROFESIONAL CON PERSONAL A CARGO","Orientación a resultados ","Realizar las funciones y cumplir los compromisos organizacionales con eficacia y calidad. ","▪ Cumple con oportunidad en función de estándares, objetivos y metas establecidas por la entidad, las funciones que le son asignadas.\n▪ Asume la responsabilidad por sus resultados.\n▪ Compromete recursos y tiempos para mejorar la productividad tomando las medidas necesarias para minimizar los riesgos.\n▪ Realiza todas las acciones necesarias para alcanzar los objetivos propuestos enfrentando los obstáculos que se presentan."]
["ALTO",8,null,null,null,null,8,null,null,null,null,null,null,null,null,"2016-09-03",null,null,null,null,null,null,239,null,null,null,25.799999999999901,"NO SATISFACTORIO",null,"PROFESIONAL CON PERSONAL A CARGO","Orientación al usuario y al ciudadano","Dirigir las decisiones y acciones a la satisfacción de las necesidades e intereses de los usuarios internos y externos, de conformidad con las responsabilidades públicas asignadas a la entidad.","▪ Atiende y valora las necesidades y peticiones de los usuarios y de ciudadanos en general.\n▪Considera las necesidades de los usuarios al diseñar proyectos o servicios.\n▪Da respuesta oportuna a las necesidades de los usuarios de conformidad con el servicio que ofrece la entidad.\n▪Establece diferentes canales de comunicación con el usuario para conocer sus necesidades y propuestas y responde a las mismas.\n▪Reconoce la interdependencia entre su trabajo y el de otros.\n"]
["MUY ALTO",10,null,null,null,null,10,null,null,null,null,null,null,null,null,"2016-09-04",null,null,null,null,null,null,240,null,null,null,25.899999999999899,"NO SATISFACTORIO",null,"PROFESIONAL CON PERSONAL A CARGO","Compromiso con la Organización","Alinear el propio comportamiento a las necesidades, prioridades y metas organizacionales.","▪Promueve las metas de la organización y respeta sus normas.\n▪Antepone las necesidades de la organización a sus propias necesidades.\n▪Apoya a la organización en situaciones difíciles.\n▪Demuestra sentido de pertenencia en todas sus actuaciones."]
[null,null,null,null,null,null,null,null,null,null,null,null,null,null,null,"2016-09-05",null,null,null,null,null,null,241,null,null,null,25.999999999999901,"NO SATISFACTORIO",null,"TÈCNICO","Experticia Técnica","Entender y aplicar los conocimientos técnicos del área de desempeño y mantenerlos actualizados","▪Capta y asimila con facilidad conceptos e información.\n▪Aplica el conocimiento técnico a las actividades cotidianas.\n▪Analiza la información de acuerdo con las necesidades de la organización.\n▪Comprende los aspectos técnicos y los aplica al desarrollo de procesos y procedimientos en los que está involucrado.\n▪Resuelve problemas utilizando sus conocimientos técnicos de su especialidad y garantizando indicadores y estándares establecidos."]
[null,null,null,null,null,null,null,null,null,null,null,null,null,null,null,"2016-09-06",null,null,null,null,null,null,242,null,null,null,26.099999999999898,"NO SATISFACTORIO",null,"TÈCNICO","Trabajo en equipo","Trabajar con otros para conseguir metas comunes","▪Identifica claramente los objetivos del grupo y orienta su trabajo a la consecución de los mismos.\n▪Colabora con otros para la realización de actividades y metas grupales."]
[1,"1. Cambios en los planes, programas o proyectos que sirvieron de base para la concertación.",null,null,null,null,null,null,null,null,null,null,null,null,null,"2016-09-07",null,null,null,null,null,null,243,null,null,null,26.1999999999999,"NO SATISFACTORIO",null,"TÈCNICO","Creatividad e innovación","Presentar ideas y métodos novedosos y concretarlos en acciones","▪Propone y encuentra formas nuevas y eficaces de hacer las cosas.\n▪Es recursivo.\n▪Es práctico.\n▪Busca nuevas alternativas de solución.\n▪Revisa permanentemente los procesos y procedimientos para optimizar los resultados."]
[2,"2. Separación del cargo superior a treinta (30) días calendario que afecte el cumplimiento de los compromisos. ",null,null,null,null,null,null,null,null,null,null,null,null,null,"2016-09-08",null,null,null,null,null,null,244,null,null,null,26.299999999999901,"NO SATISFACTORIO",null,"TÈCNICO","Orientación a resultados ","Realizar las funciones y cumplir los compromisos organizacionales con eficacia y calidad. ","▪ Cumple con oportunidad en función de estándares, objetivos y metas establecidas por la entidad, las funciones que le son asignadas.\n▪ Asume la responsabilidad por sus resultados.\n▪ Compromete recursos y tiempos para mejorar la productividad tomando las medidas necesarias para minimizar los riesgos.\n▪ Realiza todas las acciones necesarias para alcanzar los objetivos propuestos enfrentando los obstáculos que se presentan."]
[3,"3. Traslado o encargo del empleado.",null,null,null,null,null,null,null,null,null,null,null,null,null,"2016-09-09",null,null,null,null,null,null,245,null,null,null,26.399999999999899,"NO SATISFACTORIO",null,"TÈCNICO","Orientación al usuario y al ciudadano","Dirigir las decisiones y acciones a la satisfacción de las necesidades e intereses de los usuarios internos y externos, de conformidad con las responsabilidades públicas asignadas a la entidad.","▪ Atiende y valora las necesidades y peticiones de los usuarios y de ciudadanos en general.\n▪Considera las necesidades de los usuarios al diseñar proyectos o servicios.\n▪Da respuesta oportuna a las necesidades de los usuarios de conformidad con el servicio que ofrece la entidad.\n▪Establece diferentes canales de comunicación con el usuario para conocer sus necesidades y propuestas y responde a las mismas.\n▪Reconoce la interdependencia entre su trabajo y el de otros.\n"]
[4,null,null,null,null,null,null,null,null,null,null,null,null,null,null,"2016-09-10",null,null,null,null,null,null,246,null,null,null,26.499999999999901,"NO SATISFACTORIO",null,"TÈCNICO","Compromiso con la Organización","Alinear el propio comportamiento a las necesidades, prioridades y metas organizacionales.","▪Promueve las metas de la organización y respeta sus normas.\n▪Antepone las necesidades de la organización a sus propias necesidades.\n▪Apoya a la organización en situaciones difíciles.\n▪Demuestra sentido de pertenencia en todas sus actuaciones."]
[5,null,null,null,null,null,null,null,null,null,null,null,null,null,null,"2016-09-11",null,null,null,null,null,null,247,null,null,null,26.599999999999898,"NO SATISFACTORIO",null,"ASISTENCIAL","Manejo de la información","Manejar con respeto las informaciones personales e institucionales de que dispone.","▪Evade temas que indagan sobre información confidencial.\n▪Recoge sólo información imprescindible para el desarrollo de la tarea.\n▪Organiza y guarda de forma adecuada la información a su cuidado, teniendo en cuenta las normas legales y de la organización.\n▪No hace pública información laboral o de las personas que pueda afectar la organización o las personas.\n"]
[6,null,null,null,null,null,null,null,null,null,null,null,null,null,null,"2016-09-12",null,null,null,null,null,null,248,null,null,null,26.6999999999999,"NO SATISFACTORIO",null,"ASISTENCIAL","Adaptación al cambio","Enfrentarse con flexibilidad y versatilidad a situaciones nuevas para aceptar los cambios positiva y constructivamente.","▪Acepta y se adapta fácilmente los cambios.\n▪Responde al cambio con flexibilidad.\n▪Promueve el cambio."]
[7,null,null,null,null,null,null,null,null,null,null,null,null,null,null,"2016-09-13",null,null,null,null,null,null,249,null,null,null,26.799999999999901,"NO SATISFACTORIO",null,"ASISTENCIAL","Disciplina","Adaptarse a las políticas institucionales y buscar información de los cambios en la autoridad competente.","▪Acepta instrucciones aunque se difiera de ellas.\n▪Realiza los cometidos y tareas del puesto de trabajo.\n▪Acepta la supervisión constante.\n▪Realiza funciones orientadas a apoyar la acción de otros miembros de la organización."]
[8,null,null,null,null,null,null,null,null,null,null,null,null,null,null,"2016-09-14",null,null,null,null,null,null,250,null,null,null,26.899999999999899,"NO SATISFACTORIO",null,"ASISTENCIAL","Relaciones Interpersonales","Establecer y mantener relaciones de trabajo amistosas y positivas, basadas en la comunicación abierta y fluida y en el respeto por los demás.","▪Escucha con interés a las personas y capta las preocupaciones, intereses y necesidades de los demás.\n▪Transmite eficazmente las ideas, sentimientos e información impidiendo con ello malos entendidos o situaciones confusas que puedan generar conflictos."]
[9,null,null,null,null,null,null,null,null,null,null,null,null,null,null,"2016-09-15",null,null,null,null,null,null,251,null,null,null,26.999999999999901,"NO SATISFACTORIO",null,"ASISTENCIAL","Colaboración","Cooperar con los demás con el fin de alcanzar los objetivos institucionales","▪Ayuda al logro de los objetivos articulando sus actuaciones con los demás.\n▪Cumple los compromisos que adquiere.\n▪Facilita la labor de sus superiores y compañeros de trabajo."]
[10,null,null,null,null,null,null,null,null,null,null,null,null,null,null,"2016-09-16",null,null,null,null,null,null,252,null,null,null,27.099999999999898,"NO SATISFACTORIO",null,"ASISTENCIAL","Orientación a resultados ","Realizar las funciones y cumplir los compromisos organizacionales con eficacia y calidad. ","▪ Cumple con oportunidad en función de estándares, objetivos y metas establecidas por la entidad, las funciones que le son asignadas.\n▪ Asume la responsabilidad por sus resultados.\n▪ Compromete recursos y tiempos para mejorar la productividad tomando las medidas necesarias para minimizar los riesgos.\n▪ Realiza todas las acciones necesarias para alcanzar los objetivos propuestos enfrentando los obstáculos que se presentan."]
[11,null,null,null,null,null,null,null,null,null,null,null,null,null,null,"2016-09-17",null,null,null,null,null,null,253,null,null,null,27.1999999999999,"NO SATISFACTORIO",null,"ASISTENCIAL","Orientación al usuario y al ciudadano","Dirigir las decisiones y acciones a la satisfacción de las necesidades e intereses de los usuarios internos y externos, de conformidad con las responsabilidades públicas asignadas a la entidad.","▪ Atiende y valora las necesidades y peticiones de los usuarios y de ciudadanos en general.\n▪Considera las necesidades de los usuarios al diseñar proyectos o servicios.\n▪Da respuesta oportuna a las necesidades de los usuarios de conformidad con el servicio que ofrece la entidad.\n▪Establece diferentes canales de comunicación con el usuario para conocer sus necesidades y propuestas y responde a las mismas.\n▪Reconoce la interdependencia entre su trabajo y el de otros.\n"]
[12,null,null,null,null,null,null,null,null,null,null,null,null,null,null,"2016-09-18",null,null,null,null,null,null,254,null,null,null,27.299999999999901,"NO SATISFACTORIO",null,"ASISTENCIAL","Compromiso con la Organización","Alinear el propio comportamiento a las necesidades, prioridades y metas organizacionales.","▪Promueve las metas de la organización y respeta sus normas.\n▪Antepone las necesidades de la organización a sus propias necesidades.\n▪Apoya a la organización en situaciones difíciles.\n▪Demuestra sentido de pertenencia en todas sus actuaciones."]
[13,null,null,null,null,null,null,null,null,null,null,null,null,null,null,"2016-09-19",null,null,null,null,null,null,255,null,null,null,27.399999999999899,"NO SATISFACTORIO"]
[14,null,null,null,null,null,null,null,null,null,null,null,null,null,null,"2016-09-20",null,null,null,null,null,null,256,null,null,null,27.499999999999901,"NO SATISFACTORIO"]
[15,null,null,null,null,null,null,null,null,null,null,null,null,null,null,"2016-09-21",null,null,null,null,null,null,257,null,null,null,27.599999999999898,"NO SATISFACTORIO"]
[16,null,null,null,null,null,null,null,null,null,null,null,null,null,null,"2016-09-22",null,null,null,null,null,null,258,null,null,null,27.6999999999999,"NO SATISFACTORIO"]
[17,null,null,null,null,null,null,null,null,null,null,null,null,null,null,"2016-09-23",null,null,null,null,null,null,259,null,null,null,27.799999999999901,"NO SATISFACTORIO"]
[18,null,null,null,null,null,null,null,null,null,null,null,null,null,null,"2016-09-24",null,null,null,null,null,null,260,null,null,null,27.899999999999899,"NO SATISFACTORIO"]
[19,null,null,null,null,null,null,null,null,null,null,null,null,null,null,"2016-09-25",null,null,null,null,null,null,261,null,null,null,27.999999999999901,"NO SATISFACTORIO"]
[20,null,null,null,null,null,null,null,null,null,null,null,null,null,null,"2016-09-26",null,null,null,null,null,null,262,null,null,null,28.099999999999898,"NO SATISFACTORIO"]
[21,null,null,null,null,null,null,null,null,null,null,null,null,null,null,"2016-09-27",null,null,null,null,null,null,263,null,null,null,28.1999999999999,"NO SATISFACTORIO"]
[22,null,null,null,null,null,null,null,null,null,null,null,null,null,null,"2016-09-28",null,null,null,null,null,null,264,null,null,null,28.299999999999901,"NO SATISFACTORIO"]
[23,null,null,null,null,null,null,null,null,null,null,null,null,null,null,"2016-09-29",null,null,null,null,null,null,265,null,null,null,28.399999999999899,"NO SATISFACTORIO"]
[24,null,null,null,null,null,null,null,null,null,null,null,null,null,null,"2016-09-30",null,null,null,null,null,null,266,null,null,null,28.499999999999901,"NO SATISFACTORIO"]
[25,null,null,null,null,null,null,null,null,null,null,null,null,null,null,"2016-10-01",null,null,null,null,null,null,267,null,null,null,28.599999999999898,"NO SATISFACTORIO"]
[26,null,null,null,null,null,null,null,null,null,null,null,null,null,null,"2016-10-02",null,null,null,null,null,null,268,null,null,null,28.6999999999999,"NO SATISFACTORIO"]
[27,null,null,null,null,null,null,null,null,null,null,null,null,null,null,"2016-10-03",null,null,null,null,null,null,269,null,null,null,28.799999999999901,"NO SATISFACTORIO"]
[28,null,null,null,null,null,null,null,null,null,null,null,null,null,null,"2016-10-04",null,null,null,null,null,null,270,null,null,null,28.899999999999899,"NO SATISFACTORIO"]
[29,null,null,null,null,null,null,null,null,null,null,null,null,null,null,"2016-10-05",null,null,null,null,null,null,271,null,null,null,28.999999999999901,"NO SATISFACTORIO"]
[30,null,null,null,null,null,null,null,null,null,null,null,null,null,null,"2016-10-06",null,null,null,null,null,null,272,null,null,null,29.099999999999898,"NO SATISFACTORIO"]
[31,null,null,null,null,null,null,null,null,null,null,null,null,null,null,"2016-10-07",null,null,null,null,null,null,273,null,null,null,29.1999999999999,"NO SATISFACTORIO"]
[32,null,null,null,null,null,null,null,null,null,null,null,null,null,null,"2016-10-08",null,null,null,null,null,null,274,null,null,null,29.299999999999901,"NO SATISFACTORIO"]
[33,null,null,null,null,null,null,null,null,null,null,null,null,null,null,"2016-10-09",null,null,null,null,null,null,275,null,null,null,29.399999999999899,"NO SATISFACTORIO"]
[34,null,null,null,null,null,null,null,null,null,null,null,null,null,null,"2016-10-10",null,null,null,null,null,null,276,null,null,null,29.499999999999901,"NO SATISFACTORIO"]
[35,null,null,null,null,null,null,null,null,null,null,null,null,null,null,"2016-10-11",null,null,null,null,null,null,277,null,null,null,29.599999999999898,"NO SATISFACTORIO"]
[36,null,null,null,null,null,null,null,null,null,null,null,null,null,null,"2016-10-12",null,null,null,null,null,null,278,null,null,null,29.6999999999999,"NO SATISFACTORIO"]
[37,null,null,null,null,null,null,null,null,null,null,null,null,null,null,"2016-10-13",null,null,null,null,null,null,279,null,null,null,29.799999999999901,"NO SATISFACTORIO"]
[38,null,null,null,null,null,null,null,null,null,null,null,null,null,null,"2016-10-14",null,null,null,null,null,null,280,null,null,null,29.899999999999899,"NO SATISFACTORIO"]
[39,null,null,null,null,null,null,null,null,null,null,null,null,null,null,"2016-10-15",null,null,null,null,null,null,281,null,null,null,29.999999999999901,"NO SATISFACTORIO"]
[40,null,null,null,null,null,null,null,null,null,null,null,null,null,null,"2016-10-16",null,null,null,null,null,null,282,null,null,null,30.099999999999898,"NO SATISFACTORIO"]
[41,null,null,null,null,null,null,null,null,null,null,null,null,null,null,"2016-10-17",null,null,null,null,null,null,283,null,null,null,30.1999999999999,"NO SATISFACTORIO"]
[42,null,null,null,null,null,null,null,null,null,null,null,null,null,null,"2016-10-18",null,null,null,null,null,null,284,null,null,null,30.299999999999901,"NO SATISFACTORIO"]
[43,null,null,null,null,null,null,null,null,null,null,null,null,null,null,"2016-10-19",null,null,null,null,null,null,285,null,null,null,30.399999999999899,"NO SATISFACTORIO"]
[44,null,null,null,null,null,null,null,null,null,null,null,null,null,null,"2016-10-20",null,null,null,null,null,null,286,null,null,null,30.499999999999901,"NO SATISFACTORIO"]
[45,null,null,null,null,null,null,null,null,null,null,null,null,null,null,"2016-10-21",null,null,null,null,null,null,287,null,null,null,30.599999999999898,"NO SATISFACTORIO"]
[46,null,null,null,null,null,null,null,null,null,null,null,null,null,null,"2016-10-22",null,null,null,null,null,null,288,null,null,null,30.6999999999999,"NO SATISFACTORIO"]
[47,null,null,null,null,null,null,null,null,null,null,null,null,null,null,"2016-10-23",null,null,null,null,null,null,289,null,null,null,30.799999999999901,"NO SATISFACTORIO"]
[48,null,null,null,null,null,null,null,null,null,null,null,null,null,null,"2016-10-24",null,null,null,null,null,null,290,null,null,null,30.899999999999899,"NO SATISFACTORIO"]
[49,null,null,null,null,null,null,null,null,null,null,null,null,null,null,"2016-10-25",null,null,null,null,null,null,291,null,null,null,30.999999999999901,"NO SATISFACTORIO"]
[50,null,null,null,null,null,null,null,null,null,null,null,null,null,null,"2016-10-26",null,null,null,null,null,null,292,null,null,null,31.099999999999898,"NO SATISFACTORIO"]
[51,null,null,null,null,null,null,null,null,null,null,null,null,null,null,"2016-10-27",null,null,null,null,null,null,293,null,null,null,31.1999999999999,"NO SATISFACTORIO"]
[52,null,null,null,null,null,null,null,null,null,null,null,null,null,null,"2016-10-28",null,null,null,null,null,null,294,null,null,null,31.299999999999901,"NO SATISFACTORIO"]
[53,null,null,null,null,null,null,null,null,null,null,null,null,null,null,"2016-10-29",null,null,null,null,null,null,295,null,null,null,31.399999999999899,"NO SATISFACTORIO"]
[54,null,null,null,null,null,null,null,null,null,null,null,null,null,null,"2016-10-30",null,null,null,null,null,null,296,null,null,null,31.499999999999901,"NO SATISFACTORIO"]
[55,null,null,null,null,null,null,null,null,null,null,null,null,null,null,"2016-10-31",null,null,null,null,null,null,297,null,null,null,31.599999999999898,"NO SATISFACTORIO"]
[56,null,null,null,null,null,null,null,null,null,null,null,null,null,null,"2016-11-01",null,null,null,null,null,null,298,null,null,null,31.6999999999999,"NO SATISFACTORIO"]
[57,null,null,null,null,null,null,null,null,null,null,null,null,null,null,"2016-11-02",null,null,null,null,null,null,299,null,null,null,31.799999999999901,"NO SATISFACTORIO"]
[58,null,null,null,null,null,null,null,null,null,null,null,null,null,null,"2016-11-03",null,null,null,null,null,null,300,null,null,null,31.899999999999899,"NO SATISFACTORIO"]
[59,null,null,null,null,null,null,null,null,null,null,null,null,null,null,"2016-11-04",null,null,null,null,null,null,301,null,null,null,31.999999999999901,"NO SATISFACTORIO"]
[60,null,null,null,null,null,null,null,null,null,null,null,null,null,null,"2016-11-05",null,null,null,null,null,null,302,null,null,null,32.099999999999902,"NO SATISFACTORIO"]
[61,null,null,null,null,null,null,null,null,null,null,null,null,null,null,"2016-11-06",null,null,null,null,null,null,303,null,null,null,32.199999999999903,"NO SATISFACTORIO"]
[62,null,null,null,null,null,null,null,null,null,null,null,null,null,null,"2016-11-07",null,null,null,null,null,null,304,null,null,null,32.299999999999898,"NO SATISFACTORIO"]
[63,null,null,null,null,null,null,null,null,null,null,null,null,null,null,"2016-11-08",null,null,null,null,null,null,305,null,null,null,32.399999999999899,"NO SATISFACTORIO"]
[64,null,null,null,null,null,null,null,null,null,null,null,null,null,null,"2016-11-09",null,null,null,null,null,null,306,null,null,null,32.499999999999901,"NO SATISFACTORIO"]
[65,null,null,null,null,null,null,null,null,null,null,null,null,null,null,"2016-11-10",null,null,null,null,null,null,307,null,null,null,32.599999999999902,"NO SATISFACTORIO"]
[66,null,null,null,null,null,null,null,null,null,null,null,null,null,null,"2016-11-11",null,null,null,null,null,null,308,null,null,null,32.699999999999903,"NO SATISFACTORIO"]
[67,null,null,null,null,null,null,null,null,null,null,null,null,null,null,"2016-11-12",null,null,null,null,null,null,309,null,null,null,32.799999999999898,"NO SATISFACTORIO"]
[68,null,null,null,null,null,null,null,null,null,null,null,null,null,null,"2016-11-13",null,null,null,null,null,null,310,null,null,null,32.899999999999899,"NO SATISFACTORIO"]
[69,null,null,null,null,null,null,null,null,null,null,null,null,null,null,"2016-11-14",null,null,null,null,null,null,311,null,null,null,32.999999999999901,"NO SATISFACTORIO"]
[70,null,null,null,null,null,null,null,null,null,null,null,null,null,null,"2016-11-15",null,null,null,null,null,null,312,null,null,null,33.099999999999902,"NO SATISFACTORIO"]
[71,null,null,null,null,null,null,null,null,null,null,null,null,null,null,"2016-11-16",null,null,null,null,null,null,313,null,null,null,33.199999999999903,"NO SATISFACTORIO"]
[72,null,null,null,null,null,null,null,null,null,null,null,null,null,null,"2016-11-17",null,null,null,null,null,null,314,null,null,null,33.299999999999898,"NO SATISFACTORIO"]
[73,null,null,null,null,null,null,null,null,null,null,null,null,null,null,"2016-11-18",null,null,null,null,null,null,315,null,null,null,33.399999999999899,"NO SATISFACTORIO"]
[74,null,null,null,null,null,null,null,null,null,null,null,null,null,null,"2016-11-19",null,null,null,null,null,null,316,null,null,null,33.499999999999901,"NO SATISFACTORIO"]
[75,null,null,null,null,null,null,null,null,null,null,null,null,null,null,"2016-11-20",null,null,null,null,null,null,317,null,null,null,33.599999999999902,"NO SATISFACTORIO"]
[76,null,null,null,null,null,null,null,null,null,null,null,null,null,null,"2016-11-21",null,null,null,null,null,null,318,null,null,null,33.699999999999903,"NO SATISFACTORIO"]
[77,null,null,null,null,null,null,null,null,null,null,null,null,null,null,"2016-11-22",null,null,null,null,null,null,319,null,null,null,33.799999999999898,"NO SATISFACTORIO"]
[78,null,null,null,null,null,null,null,null,null,null,null,null,null,null,"2016-11-23",null,null,null,null,null,null,320,null,null,null,33.899999999999899,"NO SATISFACTORIO"]
[79,null,null,null,null,null,null,null,null,null,null,null,null,null,null,"2016-11-24",null,null,null,null,null,null,321,null,null,null,33.999999999999901,"NO SATISFACTORIO"]
[80,null,null,null,null,null,null,null,null,null,null,null,null,null,null,"2016-11-25",null,null,null,null,null,null,322,null,null,null,34.099999999999902,"NO SATISFACTORIO"]
[81,null,null,null,null,null,null,null,null,null,null,null,null,null,null,"2016-11-26",null,null,null,null,null,null,323,null,null,null,34.199999999999903,"NO SATISFACTORIO"]
[82,null,null,null,null,null,null,null,null,null,null,null,null,null,null,"2016-11-27",null,null,null,null,null,null,324,null,null,null,34.299999999999898,"NO SATISFACTORIO"]
[83,null,null,null,null,null,null,null,null,null,null,null,null,null,null,"2016-11-28",null,null,null,null,null,null,325,null,null,null,34.399999999999899,"NO SATISFACTORIO"]
[84,null,null,null,null,null,null,null,null,null,null,null,null,null,null,"2016-11-29",null,null,null,null,null,null,326,null,null,null,34.499999999999901,"NO SATISFACTORIO"]
[85,null,null,null,null,null,null,null,null,null,null,null,null,null,null,"2016-11-30",null,null,null,null,null,null,327,null,null,null,34.599999999999902,"NO SATISFACTORIO"]
[86,null,null,null,null,null,null,null,null,null,null,null,null,null,null,"2016-12-01",null,null,null,null,null,null,328,null,null,null,34.699999999999903,"NO SATISFACTORIO"]
[87,null,null,null,null,null,null,null,null,null,null,null,null,null,null,"2016-12-02",null,null,null,null,null,null,329,null,null,null,34.799999999999898,"NO SATISFACTORIO"]
[88,null,null,null,null,null,null,null,null,null,null,null,null,null,null,"2016-12-03",null,null,null,null,null,null,330,null,null,null,34.899999999999899,"NO SATISFACTORIO"]
[89,null,null,null,null,null,null,null,null,null,null,null,null,null,null,"2016-12-04",null,null,null,null,null,null,331,null,null,null,34.999999999999901,"NO SATISFACTORIO"]
[90,null,null,null,null,null,null,null,null,null,null,null,null,null,null,"2016-12-05",null,null,null,null,null,null,332,null,null,null,35.099999999999902,"NO SATISFACTORIO"]
[91,null,null,null,null,null,null,null,null,null,null,null,null,null,null,"2016-12-06",null,null,null,null,null,null,333,null,null,null,35.199999999999903,"NO SATISFACTORIO"]
[92,null,null,null,null,null,null,null,null,null,null,null,null,null,null,"2016-12-07",null,null,null,null,null,null,334,null,null,null,35.299999999999898,"NO SATISFACTORIO"]
[93,null,null,null,null,null,null,null,null,null,null,null,null,null,null,"2016-12-08",null,null,null,null,null,null,335,null,null,null,35.399999999999899,"NO SATISFACTORIO"]
[94,null,null,null,null,null,null,null,null,null,null,null,null,null,null,"2016-12-09",null,null,null,null,null,null,336,null,null,null,35.499999999999901,"NO SATISFACTORIO"]
[95,null,null,null,null,null,null,null,null,null,null,null,null,null,null,"2016-12-10",null,null,null,null,null,null,337,null,null,null,35.599999999999902,"NO SATISFACTORIO"]
[96,null,null,null,null,null,null,null,null,null,null,null,null,null,null,"2016-12-11",null,null,null,null,null,null,338,null,null,null,35.699999999999903,"NO SATISFACTORIO"]
[97,null,null,null,null,null,null,null,null,null,null,null,null,null,null,"2016-12-12",null,null,null,null,null,null,339,null,null,null,35.799999999999898,"NO SATISFACTORIO"]
[98,null,null,null,null,null,null,null,null,null,null,null,null,null,null,"2016-12-13",null,null,null,null,null,null,340,null,null,null,35.899999999999899,"NO SATISFACTORIO"]
[99,null,null,null,null,null,null,null,null,null,null,null,null,null,null,"2016-12-14",null,null,null,null,null,null,341,null,null,null,35.999999999999901,"NO SATISFACTORIO"]
[100,null,null,null,null,null,null,null,null,null,null,null,null,null,null,"2016-12-15",null,null,null,null,null,null,342,null,null,null,36.099999999999902,"NO SATISFACTORIO"]
[101,null,null,null,null,null,null,null,null,null,null,null,null,null,null,"2016-12-16",null,null,null,null,null,null,343,null,null,null,36.199999999999903,"NO SATISFACTORIO"]
[102,null,null,null,null,null,null,null,null,null,null,null,null,null,null,"2016-12-17",null,null,null,null,null,null,344,null,null,null,36.299999999999898,"NO SATISFACTORIO"]
[103,null,null,null,null,null,null,null,null,null,null,null,null,null,null,"2016-12-18",null,null,null,null,null,null,345,null,null,null,36.399999999999899,"NO SATISFACTORIO"]
[104,null,null,null,null,null,null,null,null,null,null,null,null,null,null,"2016-12-19",null,null,null,null,null,null,346,null,null,null,36.499999999999901,"NO SATISFACTORIO"]
[105,null,null,null,null,null,null,null,null,null,null,null,null,null,null,"2016-12-20",null,null,null,null,null,null,347,null,null,null,36.599999999999902,"NO SATISFACTORIO"]
[106,null,null,null,null,null,null,null,null,null,null,null,null,null,null,"2016-12-21",null,null,null,null,null,null,348,null,null,null,36.699999999999903,"NO SATISFACTORIO"]
[107,null,null,null,null,null,null,null,null,null,null,null,null,null,null,"2016-12-22",null,null,null,null,null,null,349,null,null,null,36.799999999999898,"NO SATISFACTORIO"]
[108,null,null,null,null,null,null,null,null,null,null,null,null,null,null,"2016-12-23",null,null,null,null,null,null,350,null,null,null,36.899999999999899,"NO SATISFACTORIO"]
[109,null,null,null,null,null,null,null,null,null,null,null,null,null,null,"2016-12-24",null,null,null,null,null,null,351,null,null,null,36.999999999999901,"NO SATISFACTORIO"]
[110,null,null,null,null,null,null,null,null,null,null,null,null,null,null,"2016-12-25",null,null,null,null,null,null,352,null,null,null,37.099999999999902,"NO SATISFACTORIO"]
[111,null,null,null,null,null,null,null,null,null,null,null,null,null,null,"2016-12-26",null,null,null,null,null,null,353,null,null,null,37.199999999999903,"NO SATISFACTORIO"]
[112,null,null,null,null,null,null,null,null,null,null,null,null,null,null,"2016-12-27",null,null,null,null,null,null,354,null,null,null,37.299999999999898,"NO SATISFACTORIO"]
[113,null,null,null,null,null,null,null,null,null,null,null,null,null,null,"2016-12-28",null,null,null,null,null,null,355,null,null,null,37.399999999999899,"NO SATISFACTORIO"]
[114,null,null,null,null,null,null,null,null,null,null,null,null,null,null,"2016-12-29",null,null,null,null,null,null,356,null,null,null,37.499999999999901,"NO SATISFACTORIO"]
[115,null,null,null,null,null,null,null,null,null,null,null,null,null,null,"2016-12-30",null,null,null,null,null,null,357,null,null,null,37.599999999999902,"NO SATISFACTORIO"]
[116,null,null,null,null,null,null,null,null,null,null,null,null,null,null,"2016-12-31",null,null,null,null,null,null,358,null,null,null,37.699999999999903,"NO SATISFACTORIO"]
[117,null,null,null,null,null,null,null,null,null,null,null,null,null,null,"2017-01-01",null,null,null,null,null,null,359,null,null,null,37.799999999999898,"NO SATISFACTORIO"]
[118,null,null,null,null,null,null,null,null,null,null,null,null,null,null,"2017-01-02",null,null,null,null,null,null,360,null,null,null,37.899999999999899,"NO SATISFACTORIO"]
[119,null,null,null,null,null,null,null,null,null,null,null,null,null,null,"2017-01-03",null,null,null,null,null,null,null,null,null,null,37.999999999999901,"NO SATISFACTORIO"]
[120,null,null,null,null,null,null,null,null,null,null,null,null,null,null,"2017-01-04",null,null,null,null,null,null,null,null,null,null,38.099999999999902,"NO SATISFACTORIO"]
[121,null,null,null,null,null,null,null,null,null,null,null,null,null,null,"2017-01-05",null,null,null,null,null,null,null,null,null,null,38.199999999999903,"NO SATISFACTORIO"]
[122,null,null,null,null,null,null,null,null,null,null,null,null,null,null,"2017-01-06",null,null,null,null,null,null,null,null,null,null,38.299999999999898,"NO SATISFACTORIO"]
[123,null,null,null,null,null,null,null,null,null,null,null,null,null,null,"2017-01-07",null,null,null,null,null,null,null,null,null,null,38.399999999999899,"NO SATISFACTORIO"]
[124,null,null,null,null,null,null,null,null,null,null,null,null,null,null,"2017-01-08",null,null,null,null,null,null,null,null,null,null,38.499999999999901,"NO SATISFACTORIO"]
[125,null,null,null,null,null,null,null,null,null,null,null,null,null,null,"2017-01-09",null,null,null,null,null,null,null,null,null,null,38.599999999999902,"NO SATISFACTORIO"]
[126,null,null,null,null,null,null,null,null,null,null,null,null,null,null,"2017-01-10",null,null,null,null,null,null,null,null,null,null,38.699999999999903,"NO SATISFACTORIO"]
[127,null,null,null,null,null,null,null,null,null,null,null,null,null,null,"2017-01-11",null,null,null,null,null,null,null,null,null,null,38.799999999999898,"NO SATISFACTORIO"]
[128,null,null,null,null,null,null,null,null,null,null,null,null,null,null,"2017-01-12",null,null,null,null,null,null,null,null,null,null,38.899999999999899,"NO SATISFACTORIO"]
[129,null,null,null,null,null,null,null,null,null,null,null,null,null,null,"2017-01-13",null,null,null,null,null,null,null,null,null,null,38.999999999999901,"NO SATISFACTORIO"]
[130,null,null,null,null,null,null,null,null,null,null,null,null,null,null,"2017-01-14",null,null,null,null,null,null,null,null,null,null,39.099999999999902,"NO SATISFACTORIO"]
[131,null,null,null,null,null,null,null,null,null,null,null,null,null,null,"2017-01-15",null,null,null,null,null,null,null,null,null,null,39.199999999999903,"NO SATISFACTORIO"]
[132,null,null,null,null,null,null,null,null,null,null,null,null,null,null,"2017-01-16",null,null,null,null,null,null,null,null,null,null,39.299999999999898,"NO SATISFACTORIO"]
[133,null,null,null,null,null,null,null,null,null,null,null,null,null,null,"2017-01-17",null,null,null,null,null,null,null,null,null,null,39.399999999999899,"NO SATISFACTORIO"]
[134,null,null,null,null,null,null,null,null,null,null,null,null,null,null,"2017-01-18",null,null,null,null,null,null,null,null,null,null,39.499999999999901,"NO SATISFACTORIO"]
[135,null,null,null,null,null,null,null,null,null,null,null,null,null,null,"2017-01-19",null,null,null,null,null,null,null,null,null,null,39.599999999999902,"NO SATISFACTORIO"]
[136,null,null,null,null,null,null,null,null,null,null,null,null,null,null,"2017-01-20",null,null,null,null,null,null,null,null,null,null,39.699999999999903,"NO SATISFACTORIO"]
[137,null,null,null,null,null,null,null,null,null,null,null,null,null,null,"2017-01-21",null,null,null,null,null,null,null,null,null,null,39.799999999999898,"NO SATISFACTORIO"]
[138,null,null,null,null,null,null,null,null,null,null,null,null,null,null,"2017-01-22",null,null,null,null,null,null,null,null,null,null,39.899999999999899,"NO SATISFACTORIO"]
[139,null,null,null,null,null,null,null,null,null,null,null,null,null,null,"2017-01-23",null,null,null,null,null,null,null,null,null,null,39.999999999999901,"NO SATISFACTORIO"]
[140,null,null,null,null,null,null,null,null,null,null,null,null,null,null,"2017-01-24",null,null,null,null,null,null,null,null,null,null,40.099999999999902,"NO SATISFACTORIO"]
[141,null,null,null,null,null,null,null,null,null,null,null,null,null,null,"2017-01-25",null,null,null,null,null,null,null,null,null,null,40.199999999999903,"NO SATISFACTORIO"]
[142,null,null,null,null,null,null,null,null,null,null,null,null,null,null,"2017-01-26",null,null,null,null,null,null,null,null,null,null,40.299999999999898,"NO SATISFACTORIO"]
[143,null,null,null,null,null,null,null,null,null,null,null,null,null,null,"2017-01-27",null,null,null,null,null,null,null,null,null,null,40.399999999999899,"NO SATISFACTORIO"]
[144,null,null,null,null,null,null,null,null,null,null,null,null,null,null,"2017-01-28",null,null,null,null,null,null,null,null,null,null,40.499999999999901,"NO SATISFACTORIO"]
[145,null,null,null,null,null,null,null,null,null,null,null,null,null,null,"2017-01-29",null,null,null,null,null,null,null,null,null,null,40.599999999999902,"NO SATISFACTORIO"]
[146,null,null,null,null,null,null,null,null,null,null,null,null,null,null,"2017-01-30",null,null,null,null,null,null,null,null,null,null,40.699999999999903,"NO SATISFACTORIO"]
[147,null,null,null,null,null,null,null,null,null,null,null,null,null,null,"2017-01-31",null,null,null,null,null,null,null,null,null,null,40.799999999999898,"NO SATISFACTORIO"]
[148,null,null,null,null,null,null,null,null,null,null,null,null,null,null,"2017-02-01",null,null,null,null,null,null,null,null,null,null,40.899999999999899,"NO SATISFACTORIO"]
[149,null,null,null,null,null,null,null,null,null,null,null,null,null,null,"2017-02-02",null,null,null,null,null,null,null,null,null,null,40.999999999999901,"NO SATISFACTORIO"]
[150,null,null,null,null,null,null,null,null,null,null,null,null,null,null,"2017-02-03",null,null,null,null,null,null,null,null,null,null,41.099999999999902,"NO SATISFACTORIO"]
[151,null,null,null,null,null,null,null,null,null,null,null,null,null,null,"2017-02-04",null,null,null,null,null,null,null,null,null,null,41.199999999999903,"NO SATISFACTORIO"]
[152,null,null,null,null,null,null,null,null,null,null,null,null,null,null,"2017-02-05",null,null,null,null,null,null,null,null,null,null,41.299999999999898,"NO SATISFACTORIO"]
[153,null,null,null,null,null,null,null,null,null,null,null,null,null,null,"2017-02-06",null,null,null,null,null,null,null,null,null,null,41.399999999999899,"NO SATISFACTORIO"]
[154,null,null,null,null,null,null,null,null,null,null,null,null,null,null,"2017-02-07",null,null,null,null,null,null,null,null,null,null,41.499999999999901,"NO SATISFACTORIO"]
[155,null,null,null,null,null,null,null,null,null,null,null,null,null,null,"2017-02-08",null,null,null,null,null,null,null,null,null,null,41.599999999999902,"NO SATISFACTORIO"]
[156,null,null,null,null,null,null,null,null,null,null,null,null,null,null,"2017-02-09",null,null,null,null,null,null,null,null,null,null,41.699999999999903,"NO SATISFACTORIO"]
[157,null,null,null,null,null,null,null,null,null,null,null,null,null,null,"2017-02-10",null,null,null,null,null,null,null,null,null,null,41.799999999999898,"NO SATISFACTORIO"]
[158,null,null,null,null,null,null,null,null,null,null,null,null,null,null,"2017-02-11",null,null,null,null,null,null,null,null,null,null,41.899999999999899,"NO SATISFACTORIO"]
[159,null,null,null,null,null,null,null,null,null,null,null,null,null,null,"2017-02-12",null,null,null,null,null,null,null,null,null,null,41.999999999999901,"NO SATISFACTORIO"]
[160,null,null,null,null,null,null,null,null,null,null,null,null,null,null,"2017-02-13",null,null,null,null,null,null,null,null,null,null,42.099999999999902,"NO SATISFACTORIO"]
[161,null,null,null,null,null,null,null,null,null,null,null,null,null,null,"2017-02-14",null,null,null,null,null,null,null,null,null,null,42.199999999999903,"NO SATISFACTORIO"]
[162,null,null,null,null,null,null,null,null,null,null,null,null,null,null,"2017-02-15",null,null,null,null,null,null,null,null,null,null,42.299999999999898,"NO SATISFACTORIO"]
[163,null,null,null,null,null,null,null,null,null,null,null,null,null,null,"2017-02-16",null,null,null,null,null,null,null,null,null,null,42.399999999999899,"NO SATISFACTORIO"]
[164,null,null,null,null,null,null,null,null,null,null,null,null,null,null,"2017-02-17",null,null,null,null,null,null,null,null,null,null,42.499999999999901,"NO SATISFACTORIO"]
[165,null,null,null,null,null,null,null,null,null,null,null,null,null,null,"2017-02-18",null,null,null,null,null,null,null,null,null,null,42.599999999999902,"NO SATISFACTORIO"]
[166,null,null,null,null,null,null,null,null,null,null,null,null,null,null,"2017-02-19",null,null,null,null,null,null,null,null,null,null,42.699999999999903,"NO SATISFACTORIO"]
[167,null,null,null,null,null,null,null,null,null,null,null,null,null,null,"2017-02-20",null,null,null,null,null,null,null,null,null,null,42.799999999999898,"NO SATISFACTORIO"]
[168,null,null,null,null,null,null,null,null,null,null,null,null,null,null,"2017-02-21",null,null,null,null,null,null,null,null,null,null,42.899999999999899,"NO SATISFACTORIO"]
[169,null,null,null,null,null,null,null,null,null,null,null,null,null,null,"2017-02-22",null,null,null,null,null,null,null,null,null,null,42.999999999999901,"NO SATISFACTORIO"]
[170,null,null,null,null,null,null,null,null,null,null,null,null,null,null,"2017-02-23",null,null,null,null,null,null,null,null,null,null,43.099999999999902,"NO SATISFACTORIO"]
[171,null,null,null,null,null,null,null,null,null,null,null,null,null,null,"2017-02-24",null,null,null,null,null,null,null,null,null,null,43.199999999999903,"NO SATISFACTORIO"]
[172,null,null,null,null,null,null,null,null,null,null,null,null,null,null,"2017-02-25",null,null,null,null,null,null,null,null,null,null,43.299999999999898,"NO SATISFACTORIO"]
[173,null,null,null,null,null,null,null,null,null,null,null,null,null,null,"2017-02-26",null,null,null,null,null,null,null,null,null,null,43.399999999999899,"NO SATISFACTORIO"]
[174,null,null,null,null,null,null,null,null,null,null,null,null,null,null,"2017-02-27",null,null,null,null,null,null,null,null,null,null,43.499999999999901,"NO SATISFACTORIO"]
[175,null,null,null,null,null,null,null,null,null,null,null,null,null,null,"2017-02-28",null,null,null,null,null,null,null,null,null,null,43.599999999999902,"NO SATISFACTORIO"]
[176,null,null,null,null,null,null,null,null,null,null,null,null,null,null,"2017-03-01",null,null,null,null,null,null,null,null,null,null,43.699999999999903,"NO SATISFACTORIO"]
[177,null,null,null,null,null,null,null,null,null,null,null,null,null,null,"2017-03-02",null,null,null,null,null,null,null,null,null,null,43.799999999999898,"NO SATISFACTORIO"]
[null,null,null,null,null,null,null,null,null,null,null,null,null,null,null,"2017-03-03",null,null,null,null,null,null,null,null,null,null,43.899999999999899,"NO SATISFACTORIO"]
["COMPROMISO LABORAL",null,null,null,null,null,null,null,null,null,null,null,null,null,null,"2017-03-04",null,null,null,null,null,null,null,null,null,null,43.999999999999901,"NO SATISFACTORIO"]
["COMPETENCIA COMPORTAMENTAL",null,null,null,null,null,null,null,null,null,null,null,null,null,null,"2017-03-05",null,null,null,null,null,null,null,null,null,null,44.099999999999902,"NO SATISFACTORIO"]
[null,null,null,null,null,null,null,null,null,null,null,null,null,null,null,"2017-03-06",null,null,null,null,null,null,null,null,null,null,44.199999999999903,"NO SATISFACTORIO"]
["SEGUIMIENTO",null,null,null,null,null,null,null,null,null,null,null,null,null,null,"2017-03-07",null,null,null,null,null,null,null,null,null,null,44.299999999999898,"NO SATISFACTORIO"]
["EXTRAORDINARIA",null,null,null,null,null,null,null,null,null,null,null,null,null,null,"2017-03-08",null,null,null,null,null,null,null,null,null,null,44.399999999999899,"NO SATISFACTORIO"]
["EVENTUAL",null,null,null,null,null,null,null,null,null,null,null,null,null,null,"2017-03-09",null,null,null,null,null,null,null,null,null,null,44.499999999999901,"NO SATISFACTORIO"]
["1. PARCIAL SEMESTRAL",null,null,null,null,null,null,null,null,null,null,null,null,null,null,"2017-03-10",null,null,null,null,null,null,null,null,null,null,44.599999999999902,"NO SATISFACTORIO"]
["EVA. INF. A 1 AÑO",null,null,null,null,null,null,null,null,null,null,null,null,null,null,"2017-03-11",null,null,null,null,null,null,null,null,null,null,44.699999999999903,"NO SATISFACTORIO"]
["2. PARCIAL SEMESTRAL",null,null,null,null,null,null,null,null,null,null,null,null,null,null,"2017-03-12",null,null,null,null,null,null,null,null,null,null,44.799999999999898,"NO SATISFACTORIO"]
["PERÍODO DE PRUEBA",null,null,null,null,null,null,null,null,null,null,null,null,null,null,"2017-03-13",null,null,null,null,null,null,null,null,null,null,44.899999999999899,"NO SATISFACTORIO"]
[null,null,null,null,null,null,null,null,null,null,null,null,null,null,null,"2017-03-14",null,null,null,null,null,null,null,null,null,null,44.999999999999901,"NO SATISFACTORIO"]
[null,null,null,null,null,null,null,null,null,null,null,null,null,null,null,"2017-03-15",null,null,null,null,null,null,null,null,null,null,45.099999999999902,"NO SATISFACTORIO"]
[null,null,null,null,null,null,null,null,null,null,null,null,null,null,null,"2017-03-16",null,null,null,null,null,null,null,null,null,null,45.199999999999903,"NO SATISFACTORIO"]
[null,null,null,null,null,null,null,null,null,null,null,null,null,null,null,"2017-03-17",null,null,null,null,null,null,null,null,null,null,45.299999999999898,"NO SATISFACTORIO"]
[null,null,null,null,null,null,null,null,null,null,null,null,null,null,null,"2017-03-18",null,null,null,null,null,null,null,null,null,null,45.399999999999899,"NO SATISFACTORIO"]
[null,null,null,null,null,null,null,null,null,null,null,null,null,null,null,"2017-03-19",null,null,null,null,null,null,null,null,null,null,45.499999999999901,"NO SATISFACTORIO"]
[null,null,null,null,null,null,null,null,null,null,null,null,null,null,null,"2017-03-20",null,null,null,null,null,null,null,null,null,null,45.599999999999902,"NO SATISFACTORIO"]
[null,null,null,null,null,null,null,null,null,null,null,null,null,null,null,"2017-03-21",null,null,null,null,null,null,null,null,null,null,45.699999999999903,"NO SATISFACTORIO"]
[null,null,null,null,null,null,null,null,null,null,null,null,null,null,null,"2017-03-22",null,null,null,null,null,null,null,null,null,null,45.799999999999898,"NO SATISFACTORIO"]
[null,null,null,null,null,null,null,null,null,null,null,null,null,null,null,"2017-03-23",null,null,null,null,null,null,null,null,null,null,45.899999999999899,"NO SATISFACTORIO"]
[null,null,null,null,null,null,null,null,null,null,null,null,null,null,null,"2017-03-24",null,null,null,null,null,null,null,null,null,null,45.999999999999901,"NO SATISFACTORIO"]
["NO EVALUADO",0,null,null,null,null,null,null,null,null,null,null,null,null,null,"2017-03-25",null,null,null,null,null,null,null,null,null,null,46.099999999999902,"NO SATISFACTORIO"]
["BAJO",6,4,null,null,null,null,null,null,null,null,null,null,null,null,"2017-03-26",null,null,null,null,null,null,null,null,null,null,46.199999999999903,"NO SATISFACTORIO"]
["ACEPTABLE",9,6,null,null,null,null,null,null,null,null,null,null,null,null,"2017-03-27",null,null,null,null,null,null,null,null,null,null,46.299999999999898,"NO SATISFACTORIO"]
["ALTO",12,8,null,null,null,null,null,null,null,null,null,null,null,null,"2017-03-28",null,null,null,null,null,null,null,null,null,null,46.399999999999899,"NO SATISFACTORIO"]
["MUY ALTO",15,10,null,null,null,null,null,null,null,null,null,null,null,null,"2017-03-29",null,null,null,null,null,null,null,null,null,null,46.499999999999901,"NO SATISFACTORIO"]
[null,null,null,null,null,null,null,null,null,null,null,null,null,null,null,"2017-03-30",null,null,null,null,null,null,null,null,null,null,46.599999999999902,"NO SATISFACTORIO"]
[null,null,null,null,null,null,null,null,null,null,null,null,null,null,null,"2017-03-31",null,null,null,null,null,null,null,null,null,null,46.699999999999903,"NO SATISFACTORIO"]
["Período anual u ordinario- Compromiso 1",{"$f":"#REF!","v":{"$error":"#REF!"}},null,null,null,null,null,null,null,null,null,null,null,null,null,"2017-04-01",null,null,null,null,null,null,null,null,null,null,46.799999999999898,"NO SATISFACTORIO"]
["Período anual u ordinario- Compromiso 2",{"$f":"#REF!","v":{"$error":"#REF!"}},null,null,null,null,null,null,null,null,null,null,null,null,null,"2017-04-02",null,null,null,null,null,null,null,null,null,null,46.899999999999899,"NO SATISFACTORIO"]
["Período anual u ordinario- Compromiso 3",{"$f":"#REF!","v":{"$error":"#REF!"}},null,null,null,null,null,null,null,null,null,null,null,null,null,"2017-04-03",null,null,null,null,null,null,null,null,null,null,46.999999999999901,"NO SATISFACTORIO"]
["Período anual u ordinario- Compromiso 4",{"$f":"#REF!","v":{"$error":"#REF!"}},null,null,null,null,null,null,null,null,null,null,null,null,null,"2017-04-04",null,null,null,null,null,null,null,null,null,null,47.099999999999902,"NO SATISFACTORIO"]
["Período anual u ordinario- Compromiso 5",{"$f":"#REF!","v":{"$error":"#REF!"}},null,null,null,null,null,null,null,null,null,null,null,null,null,"2017-04-05",null,null,null,null,null,null,null,null,null,null,47.199999999999903,"NO SATISFACTORIO"]
["Período anual u ordinario- Competencia 1",{"$f":"#REF!","v":{"$error":"#REF!"}},null,null,null,null,null,null,null,null,null,null,null,null,null,"2017-04-06",null,null,null,null,null,null,null,null,null,null,47.299999999999898,"NO SATISFACTORIO"]
["Período anual u ordinario- Competencia 2",{"$f":"#REF!","v":{"$error":"#REF!"}},null,null,null,null,null,null,null,null,null,null,null,null,null,"2017-04-08",null,null,null,null,null,null,null,null,null,null,47.399999999999899,"NO SATISFACTORIO"]
["Período anual u ordinario- Competencia 3",{"$f":"#REF!","v":{"$error":"#REF!"}},null,null,null,null,null,null,null,null,null,null,null,null,null,"2017-04-09",null,null,null,null,null,null,null,null,null,null,47.499999999999901,"NO SATISFACTORIO"]
["Período anual u ordinario- Competencia 4",{"$f":"#REF!","v":{"$error":"#REF!"}},null,null,null,null,null,null,null,null,null,null,null,null,null,"2017-04-10",null,null,null,null,null,null,null,null,null,null,47.599999999999902,"NO SATISFACTORIO"]
["Período de prueba- Compromiso 1",{"$f":"#REF!","v":{"$error":"#REF!"}},null,null,null,null,null,null,null,null,null,null,null,null,null,"2017-04-11",null,null,null,null,null,null,null,null,null,null,47.699999999999903,"NO SATISFACTORIO"]
["Período de prueba- Compromiso 2",{"$f":"#REF!","v":{"$error":"#REF!"}},null,null,null,null,null,null,null,null,null,null,null,null,null,"2017-04-12",null,null,null,null,null,null,null,null,null,null,47.799999999999898,"NO SATISFACTORIO"]
["Período de prueba- Compromiso 3",{"$f":"#REF!","v":{"$error":"#REF!"}},null,null,null,null,null,null,null,null,null,null,null,null,null,"2017-04-13",null,null,null,null,null,null,null,null,null,null,47.899999999999899,"NO SATISFACTORIO"]
["Período de prueba- Competencia 1",{"$f":"#REF!","v":{"$error":"#REF!"}},null,null,null,null,null,null,null,null,null,null,null,null,null,"2017-04-14",null,null,null,null,null,null,null,null,null,null,47.999999999999901,"NO SATISFACTORIO"]
["Período de prueba- Competencia 2",{"$f":"#REF!","v":{"$error":"#REF!"}},null,null,null,null,null,null,null,null,null,null,null,null,null,"2017-04-15",null,null,null,null,null,null,null,null,null,null,48.099999999999902,"NO SATISFACTORIO"]
["Período de prueba- Competencia 3",{"$f":"#REF!","v":{"$error":"#REF!"}},null,null,null,null,null,null,null,null,null,null,null,null,null,"2017-04-16",null,null,null,null,null,null,null,null,null,null,48.199999999999903,"NO SATISFACTORIO"]
["Período de prueba- Competencia 4",{"$f":"#REF!","v":{"$error":"#REF!"}},null,null,null,null,null,null,null,null,null,null,null,null,null,"2017-04-18",null,null,null,null,null,null,null,null,null,null,48.299999999999898,"NO SATISFACTORIO"]
[null,null,null,null,null,null,null,null,null,null,null,null,null,null,null,"2017-04-19",null,null,null,null,null,null,null,null,null,null,48.399999999999899,"NO SATISFACTORIO"]
[null,null,null,null,null,null,null,null,null,null,null,null,null,null,null,"2017-04-20",null,null,null,null,null,null,null,null,null,null,48.499999999999901,"NO SATISFACTORIO"]
["Período de prueba",null,null,null,null,null,null,null,null,null,null,null,null,null,null,"2017-04-21",null,null,null,null,null,null,null,null,null,null,48.599999999999902,"NO SATISFACTORIO"]
["Período anual u ordinario",null,null,null,null,null,null,null,null,null,null,null,null,null,null,"2017-04-22",null,null,null,null,null,null,null,null,null,null,48.699999999999903,"NO SATISFACTORIO"]
[null,null,null,null,null,null,null,null,null,null,null,null,null,null,null,"2017-04-23",null,null,null,null,null,null,null,null,null,null,48.799999999999898,"NO SATISFACTORIO"]
[null,null,null,null,null,null,null,null,null,null,null,null,null,null,null,"2017-04-24",null,null,null,null,null,null,null,null,null,null,48.899999999999899,"NO SATISFACTORIO"]
[null,null,null,null,null,null,null,null,null,null,null,null,null,null,null,"2017-04-25",null,null,null,null,null,null,null,null,null,null,48.999999999999901,"NO SATISFACTORIO"]
["EVALUACION EXTRAORDINARIA",null,null,null,null,null,null,null,null,null,null,null,null,null,null,"2017-04-26",null,null,null,null,null,null,null,null,null,null,49.099999999999902,"NO SATISFACTORIO"]
["SUMA EVALUACION PREVIA","SUMA EVALUACION ULTIMO PERIODO",null,null,null,null,null,null,null,null,null,null,null,null,null,"2017-04-27",null,null,null,null,null,null,null,null,null,null,49.199999999999903,"NO SATISFACTORIO"]
[{"$f":"IF(#REF!=\"\",0,VLOOKUP(#REF!,Hoja4!$A$461:$B$464,2,FALSE))","v":{"$error":"#REF!"}},{"$f":"IF(#REF!=\"\",0,VLOOKUP(#REF!,Hoja4!$A$461:$B$464,2,FALSE))","v":{"$error":"#REF!"}},null,null,null,null,null,null,null,null,null,null,null,null,null,"2017-04-28",null,null,null,null,null,null,null,null,null,null,49.299999999999898,"NO SATISFACTORIO"]
[{"$f":"IF(#REF!=\"\",0,VLOOKUP(#REF!,Hoja4!$A$461:$B$464,2,FALSE))","v":{"$error":"#REF!"}},{"$f":"IF(#REF!=\"\",0,VLOOKUP(#REF!,Hoja4!$A$461:$B$464,2,FALSE))","v":{"$error":"#REF!"}},null,null,null,null,null,null,null,null,null,null,null,null,null,"2017-04-29",null,null,null,null,null,null,null,null,null,null,49.399999999999899,"NO SATISFACTORIO"]
[{"$f":"IF(#REF!=\"\",0,VLOOKUP(#REF!,Hoja4!$A$461:$B$464,2,FALSE))","v":{"$error":"#REF!"}},{"$f":"IF(#REF!=\"\",0,VLOOKUP(#REF!,Hoja4!$A$461:$B$464,2,FALSE))","v":{"$error":"#REF!"}},null,null,null,null,null,null,null,null,null,null,null,null,null,"2017-04-30",null,null,null,null,null,null,null,null,null,null,49.499999999999901,"NO SATISFACTORIO"]
[{"$f":"IF(#REF!=\"\",0,VLOOKUP(#REF!,Hoja4!$A$461:$B$464,2,FALSE))","v":{"$error":"#REF!"}},{"$f":"IF(#REF!=\"\",0,VLOOKUP(#REF!,Hoja4!$A$461:$B$464,2,FALSE))","v":{"$error":"#REF!"}},null,null,null,null,null,null,null,null,null,null,null,null,null,"2017-05-01",null,null,null,null,null,null,null,null,null,null,49.599999999999902,"NO SATISFACTORIO"]
[{"$f":"SUBTOTAL(9,A492:A495)","v":{"$error":"#REF!"}},{"$f":"SUBTOTAL(9,B492:B495)","v":{"$error":"#REF!"}},null,null,null,null,null,null,null,null,null,null,null,null,null,"2017-05-02",null,null,null,null,null,null,null,null,null,null,49.699999999999903,"NO SATISFACTORIO"]
[null,null,null,null,null,null,null,null,null,null,null,null,null,null,null,"2017-05-03",null,null,null,null,null,null,null,null,null,null,49.799999999999898,"NO SATISFACTORIO"]
[null,null,null,null,null,null,null,null,null,null,null,null,null,null,null,"2017-05-04",null,null,null,null,null,null,null,null,null,null,49.899999999999899,"NO SATISFACTORIO"]
[null,null,null,null,null,null,null,null,null,null,null,null,null,null,null,"2017-05-05",null,null,null,null,null,null,null,null,null,null,49.999999999999901,"NO SATISFACTORIO"]
[null,null,null,null,null,null,null,null,null,null,null,null,null,null,null,"2017-05-06",null,null,null,null,null,null,null,null,null,null,50.099999999999902,"NO SATISFACTORIO"]
[null,null,null,null,null,null,null,null,null,null,null,null,null,null,null,"2017-05-07",null,null,null,null,null,null,null,null,null,null,50.199999999999903,"NO SATISFACTORIO"]
["EVALUACION INFERIOR A 1 AÑO",null,null,null,null,null,null,null,null,null,null,null,null,null,null,"2017-05-08",null,null,null,null,null,null,null,null,null,null,50.299999999999898,"NO SATISFACTORIO"]
["SUMA EVALUACION PREVIA","SUMA EVALUACION ULTIMO PERIODO",null,null,null,null,null,null,null,null,null,null,null,null,null,"2017-05-09",null,null,null,null,null,null,null,null,null,null,50.399999999999899,"NO SATISFACTORIO"]
[{"$f":"IF(#REF!=\"\",0,VLOOKUP(#REF!,Hoja4!$A$461:$C$464,3,FALSE))","v":{"$error":"#REF!"}},{"$f":"IF(#REF!=\"\",0,VLOOKUP(#REF!,Hoja4!$A$461:$C$464,3,FALSE))","v":{"$error":"#REF!"}},null,null,null,null,null,null,null,null,null,null,null,null,null,"2017-05-10",null,null,null,null,null,null,null,null,null,null,50.499999999999901,"NO SATISFACTORIO"]
[{"$f":"IF(#REF!=\"\",0,VLOOKUP(#REF!,Hoja4!$A$461:$C$464,3,FALSE))","v":{"$error":"#REF!"}},{"$f":"IF(#REF!=\"\",0,VLOOKUP(#REF!,Hoja4!$A$461:$C$464,3,FALSE))","v":{"$error":"#REF!"}},null,null,null,null,null,null,null,null,null,null,null,null,null,"2017-05-11",null,null,null,null,null,null,null,null,null,null,50.599999999999902,"NO SATISFACTORIO"]
[{"$f":"IF(#REF!=\"\",0,VLOOKUP(#REF!,Hoja4!$A$461:$C$464,3,FALSE))","v":{"$error":"#REF!"}},{"$f":"IF(#REF!=\"\",0,VLOOKUP(#REF!,Hoja4!$A$461:$C$464,3,FALSE))","v":{"$error":"#REF!"}},null,null,null,null,null,null,null,null,null,null,null,null,null,"2017-05-12",null,null,null,null,null,null,null,null,null,null,50.699999999999903,"NO SATISFACTORIO"]
[{"$f":"IF(#REF!=\"\",0,VLOOKUP(#REF!,Hoja4!$A$461:$C$464,3,FALSE))","v":{"$error":"#REF!"}},{"$f":"IF(#REF!=\"\",0,VLOOKUP(#REF!,Hoja4!$A$461:$C$464,3,FALSE))","v":{"$error":"#REF!"}},null,null,null,null,null,null,null,null,null,null,null,null,null,"2017-05-13",null,null,null,null,null,null,null,null,null,null,50.799999999999898,"NO SATISFACTORIO"]
[{"$f":"SUBTOTAL(9,A504:A507)","v":{"$error":"#REF!"}},{"$f":"SUBTOTAL(9,B504:B507)","v":{"$error":"#REF!"}},null,null,null,null,null,null,null,null,null,null,null,null,null,"2017-05-14",null,null,null,null,null,null,null,null,null,null,50.899999999999899,"NO SATISFACTORIO"]
[null,null,null,null,null,null,null,null,null,null,null,null,null,null,null,"2017-05-15",null,null,null,null,null,null,null,null,null,null,50.999999999999901,"NO SATISFACTORIO"]
[null,null,null,null,null,null,null,null,null,null,null,null,null,null,null,"2017-05-16",null,null,null,null,null,null,null,null,null,null,51.099999999999902,"NO SATISFACTORIO"]
[null,null,null,null,null,null,null,null,null,null,null,null,null,null,null,"2017-05-17",null,null,null,null,null,null,null,null,null,null,51.199999999999903,"NO SATISFACTORIO"]
["Ajuste de compromisos","Cambio de evaluador",null,null,null,null,null,null,null,null,null,null,null,null,null,"2017-05-18",null,null,null,null,null,null,null,null,null,null,51.299999999999898,"NO SATISFACTORIO"]
["Cambio de evaluador","Interrupción del período de prueba por más de 20 días calendario",null,null,null,null,null,null,null,null,null,null,null,null,null,"2017-05-19",null,null,null,null,null,null,null,null,null,null,51.399999999999899,"NO SATISFACTORIO"]
["Cambio del empleo","Lapso entre la última evaluación y el final del período",null,null,null,null,null,null,null,null,null,null,null,null,null,"2017-05-20",null,null,null,null,null,null,null,null,null,null,51.499999999999901,"NO SATISFACTORIO"]
["Lapso entre la última evaluación y el final del período",null,null,null,null,null,null,null,null,null,null,null,null,null,null,"2017-05-21",null,null,null,null,null,null,null,null,null,null,51.599999999999902,"NO SATISFACTORIO"]
["Por período de prueba en otro empleo",null,null,null,null,null,null,null,null,null,null,null,null,null,null,"2017-05-22",null,null,null,null,null,null,null,null,null,null,51.699999999999903,"NO SATISFACTORIO"]
["Separación temporal del empleo por más de 30 días calendario",null,null,null,null,null,null,null,null,null,null,null,null,null,null,"2017-05-23",null,null,null,null,null,null,null,null,null,null,51.799999999999898,"NO SATISFACTORIO"]
[null,null,null,null,null,null,null,null,null,null,null,null,null,null,null,"2017-05-24",null,null,null,null,null,null,null,null,null,null,51.8999999999998,"NO SATISFACTORIO"]
[null,null,null,null,null,null,null,null,null,null,null,null,null,null,null,"2017-05-25",null,null,null,null,null,null,null,null,null,null,51.999999999999901,"NO SATISFACTORIO"]
[null,null,null,null,null,null,null,null,null,null,null,null,null,null,null,"2017-05-26",null,null,null,null,null,null,null,null,null,null,52.099999999999902,"NO SATISFACTORIO"]
[null,null,null,null,null,null,null,null,null,null,null,null,null,null,null,"2017-05-27",null,null,null,null,null,null,null,null,null,null,52.199999999999903,"NO SATISFACTORIO"]
[null,null,null,null,null,null,null,null,null,null,null,null,null,null,null,"2017-05-28",null,null,null,null,null,null,null,null,null,null,52.299999999999898,"NO SATISFACTORIO"]
[null,null,null,null,null,null,null,null,null,null,null,null,null,null,null,"2017-05-29",null,null,null,null,null,null,null,null,null,null,52.3999999999998,"NO SATISFACTORIO"]
[null,null,null,null,null,null,null,null,null,null,null,null,null,null,null,"2017-05-30",null,null,null,null,null,null,null,null,null,null,52.499999999999901,"NO SATISFACTORIO"]
["PERIODO SEMESTRAL","CALIFICACION LABORALES","TIEMPO","% TOTAL TIEMPO","CALIFICACIÓN COMPORTAMENTALES",null,null,null,null,null,null,null,null,null,null,"2017-05-31",null,null,null,null,null,null,null,null,null,null,52.599999999999902,"NO SATISFACTORIO"]
["PRIMER SEMESTRE",{"$f":"#REF!","v":{"$error":"#REF!"}},{"$f":"#REF!","v":{"$error":"#REF!"}},{"$f":"+C526/C528","v":{"$error":"#REF!"}},{"$f":"#REF!","v":{"$error":"#REF!"}},null,null,null,null,null,null,null,null,null,null,"2017-06-01",null,null,null,null,null,null,null,null,null,null,52.699999999999797,"NO SATISFACTORIO"]
["SEGUNDO SEMESTRE",{"$f":"#REF!","v":{"$error":"#REF!"}},{"$f":"#REF!","v":{"$error":"#REF!"}},{"$f":"+C527/C529","v":{"$error":"#REF!"}},{"$f":"#REF!","v":{"$error":"#REF!"}},null,null,null,null,null,null,null,null,null,null,"2017-06-02",null,null,null,null,null,null,null,null,null,null,52.799999999999798,"NO SATISFACTORIO"]
[null,null,{"$f":"SUM(C526:C527)","v":{"$error":"#REF!"}},1]
[]
[]
[null,null,null,null,null,null,null,null,null,null,null,null,null,null,null,"2017-06-03",null,null,null,null,null,null,null,null,null,null,52.8999999999998,"NO SATISFACTORIO"]
["PARCIALES EVENTAULES","CALIFICACION LABORALES","TIEMPO",null,"CALIFICACIÓN COMPORTAMENTALES",null,null,null,null,null,null,null,null,null,null,"2017-06-04",null,null,null,null,null,null,null,null,null,null,52.999999999999901,"NO SATISFACTORIO"]
["PRIMER SEMESTRE",{"$f":"#REF!","v":{"$error":"#REF!"}},{"$f":"#REF!","v":{"$error":"#REF!"}},{"$f":"+C533/C535","v":{"$error":"#REF!"}},{"$f":"#REF!","v":{"$error":"#REF!"}},null,null,null,null,null,null,null,null,null,null,"2017-06-05",null,null,null,null,null,null,null,null,null,null,53.099999999999902,"NO SATISFACTORIO"]
["SEGUNDO SEMESTRE",{"$f":"#REF!","v":{"$error":"#REF!"}},{"$f":"#REF!","v":{"$error":"#REF!"}},{"$f":"+C534/C535","v":{"$error":"#REF!"}},{"$f":"#REF!","v":{"$error":"#REF!"}},null,null,null,null,null,null,null,null,null,null,"2017-06-06",null,null,null,null,null,null,null,null,null,null,53.199999999999797,"NO SATISFACTORIO"]
[null,null,{"$f":"SUM(C533:C534)","v":{"$error":"#REF!"}},1,null,null,null,null,null,null,null,null,null,null,null,"2017-06-07",null,null,null,null,null,null,null,null,null,null,53.299999999999798,"NO SATISFACTORIO"]
[null,null,null,null,null,null,null,null,null,null,null,null,null,null,null,"2017-06-08",null,null,null,null,null,null,null,null,null,null,53.3999999999998,"NO SATISFACTORIO"]
[null,null,null,null,null,null,null,null,null,null,null,null,null,null,null,"2017-06-09",null,null,null,null,null,null,null,null,null,null,53.499999999999801,"NO SATISFACTORIO"]
[null,null,"TIEMPO",null,null,null,null,null,null,null,null,null,null,null,null,"2017-06-10",null,null,null,null,null,null,null,null,null,null,53.599999999999802,"NO SATISFACTORIO"]
[null,"Primer Semestre",{"$f":"IF(C533=\"No Aplica\",C526,C533)","v":{"$error":"#REF!"}},{"$f":"+C539/$C$541","v":{"$error":"#REF!"}},null,null,null,null,null,null,null,null,null,null,null,"2017-06-11",null,null,null,null,null,null,null,null,null,null,53.699999999999797,"NO SATISFACTORIO"]
[null,"Segundo Semestre",{"$f":"IF(C534=\"No Aplica\",C527,C534)","v":{"$error":"#REF!"}},{"$f":"+C540/$C$541","v":{"$error":"#REF!"}},null,null,null,null,null,null,null,null,null,null,null,"2017-06-12",null,null,null,null,null,null,null,null,null,null,53.799999999999798,"NO SATISFACTORIO"]
[null,"TOTAL TIEMPO",{"$f":"SUM(C539:C540)","v":{"$error":"#REF!"}},null,null,null,null,null,null,null,null,null,null,null,null,"2017-06-13",null,null,null,null,null,null,null,null,null,null,53.8999999999998,"NO SATISFACTORIO"]
[null,null,null,null,null,null,null,null,null,null,null,null,null,null,null,"2017-06-14",null,null,null,null,null,null,null,null,null,null,53.999999999999801,"NO SATISFACTORIO"]
[null,null,null,null,null,null,null,null,null,null,null,null,null,null,null,"2017-06-15",null,null,null,null,null,null,null,null,null,null,54.099999999999802,"NO SATISFACTORIO"]
[null,null,null,null,null,null,null,null,null,null,null,null,null,null,null,"2017-06-16",null,null,null,null,null,null,null,null,null,null,54.199999999999797,"NO SATISFACTORIO"]
[null,null,null,null,null,null,null,null,null,null,null,null,null,null,null,"2017-06-17",null,null,null,null,null,null,null,null,null,null,54.299999999999798,"NO SATISFACTORIO"]
[null,null,null,null,null,null,null,null,null,null,null,null,null,null,null,"2017-06-18",null,null,null,null,null,null,null,null,null,null,54.3999999999998,"NO SATISFACTORIO"]
[null,null,null,null,null,null,null,null,null,null,null,null,null,null,null,"2017-06-19",null,null,null,null,null,null,null,null,null,null,54.499999999999801,"NO SATISFACTORIO"]
[null,null,null,null,null,null,null,null,null,null,null,null,null,null,null,"2017-06-20",null,null,null,null,null,null,null,null,null,null,54.599999999999802,"NO SATISFACTORIO"]
[null,null,null,null,null,null,null,null,null,null,null,null,null,null,null,"2017-06-21",null,null,null,null,null,null,null,null,null,null,54.699999999999797,"NO SATISFACTORIO"]
[null,null,null,null,null,null,null,null,null,null,null,null,null,null,null,"2017-06-22",null,null,null,null,null,null,null,null,null,null,54.799999999999798,"NO SATISFACTORIO"]
[null,null,null,null,null,null,null,null,null,null,null,null,null,null,null,"2017-06-23",null,null,null,null,null,null,null,null,null,null,54.8999999999998,"NO SATISFACTORIO"]
[null,null,null,null,null,null,null,null,null,null,null,null,null,null,null,"2017-06-24",null,null,null,null,null,null,null,null,null,null,54.999999999999801,"NO SATISFACTORIO"]
[null,null,null,null,null,null,null,null,null,null,null,null,null,null,null,"2017-06-25",null,null,null,null,null,null,null,null,null,null,55.099999999999802,"NO SATISFACTORIO"]
[null,null,null,null,null,null,null,null,null,null,null,null,null,null,null,"2017-06-26",null,null,null,null,null,null,null,null,null,null,55.199999999999797,"NO SATISFACTORIO"]
[null,null,null,null,null,null,null,null,null,null,null,null,null,null,null,"2017-06-27",null,null,null,null,null,null,null,null,null,null,55.299999999999798,"NO SATISFACTORIO"]
[null,null,null,null,null,null,null,null,null,null,null,null,null,null,null,"2017-06-28",null,null,null,null,null,null,null,null,null,null,55.3999999999998,"NO SATISFACTORIO"]
[null,null,null,null,null,null,null,null,null,null,null,null,null,null,null,"2017-06-29",null,null,null,null,null,null,null,null,null,null,55.499999999999801,"NO SATISFACTORIO"]
[null,null,null,null,null,null,null,null,null,null,null,null,null,null,null,"2017-06-30",null,null,null,null,null,null,null,null,null,null,55.599999999999802,"NO SATISFACTORIO"]
[null,null,null,null,null,null,null,null,null,null,null,null,null,null,null,"2017-07-01",null,null,null,null,null,null,null,null,null,null,55.699999999999797,"NO SATISFACTORIO"]
[null,null,null,null,null,null,null,null,null,null,null,null,null,null,null,"2017-07-02",null,null,null,null,null,null,null,null,null,null,55.799999999999798,"NO SATISFACTORIO"]
[null,null,null,null,null,null,null,null,null,null,null,null,null,null,null,"2017-07-03",null,null,null,null,null,null,null,null,null,null,55.8999999999998,"NO SATISFACTORIO"]
[null,null,null,null,null,null,null,null,null,null,null,null,null,null,null,"2017-07-04",null,null,null,null,null,null,null,null,null,null,55.999999999999801,"NO SATISFACTORIO"]
[null,null,null,null,null,null,null,null,null,null,null,null,null,null,null,"2017-07-05",null,null,null,null,null,null,null,null,null,null,56.099999999999802,"NO SATISFACTORIO"]
[null,null,null,null,null,null,null,null,null,null,null,null,null,null,null,"2017-07-06",null,null,null,null,null,null,null,null,null,null,56.199999999999797,"NO SATISFACTORIO"]
[null,null,null,null,null,null,null,null,null,null,null,null,null,null,null,"2017-07-07",null,null,null,null,null,null,null,null,null,null,56.299999999999798,"NO SATISFACTORIO"]
[null,null,null,null,null,null,null,null,null,null,null,null,null,null,null,"2017-07-08",null,null,null,null,null,null,null,null,null,null,56.3999999999998,"NO SATISFACTORIO"]
[null,null,null,null,null,null,null,null,null,null,null,null,null,null,null,"2017-07-09",null,null,null,null,null,null,null,null,null,null,56.499999999999801,"NO SATISFACTORIO"]
[null,null,null,null,null,null,null,null,null,null,null,null,null,null,null,"2017-07-10",null,null,null,null,null,null,null,null,null,null,56.599999999999802,"NO SATISFACTORIO"]
[null,null,null,null,null,null,null,null,null,null,null,null,null,null,null,"2017-07-11",null,null,null,null,null,null,null,null,null,null,56.699999999999797,"NO SATISFACTORIO"]
[null,null,null,null,null,null,null,null,null,null,null,null,null,null,null,"2017-07-12",null,null,null,null,null,null,null,null,null,null,56.799999999999798,"NO SATISFACTORIO"]
[null,null,null,null,null,null,null,null,null,null,null,null,null,null,null,"2017-07-13",null,null,null,null,null,null,null,null,null,null,56.8999999999998,"NO SATISFACTORIO"]
[null,null,null,null,null,null,null,null,null,null,null,null,null,null,null,"2017-07-14",null,null,null,null,null,null,null,null,null,null,56.999999999999801,"NO SATISFACTORIO"]
[null,null,null,null,null,null,null,null,null,null,null,null,null,null,null,"2017-07-15",null,null,null,null,null,null,null,null,null,null,57.099999999999802,"NO SATISFACTORIO"]
[null,null,null,null,null,null,null,null,null,null,null,null,null,null,null,"2017-07-16",null,null,null,null,null,null,null,null,null,null,57.199999999999797,"NO SATISFACTORIO"]
[null,null,null,null,null,null,null,null,null,null,null,null,null,null,null,"2017-07-17",null,null,null,null,null,null,null,null,null,null,57.299999999999798,"NO SATISFACTORIO"]
[null,null,null,null,null,null,null,null,null,null,null,null,null,null,null,"2017-07-18",null,null,null,null,null,null,null,null,null,null,57.3999999999998,"NO SATISFACTORIO"]
[null,null,null,null,null,null,null,null,null,null,null,null,null,null,null,"2017-07-19",null,null,null,null,null,null,null,null,null,null,57.499999999999801,"NO SATISFACTORIO"]
[null,null,null,null,null,null,null,null,null,null,null,null,null,null,null,"2017-07-20",null,null,null,null,null,null,null,null,null,null,57.599999999999802,"NO SATISFACTORIO"]
[null,null,null,null,null,null,null,null,null,null,null,null,null,null,null,"2017-07-21",null,null,null,null,null,null,null,null,null,null,57.699999999999797,"NO SATISFACTORIO"]
[null,null,null,null,null,null,null,null,null,null,null,null,null,null,null,"2017-07-22",null,null,null,null,null,null,null,null,null,null,57.799999999999798,"NO SATISFACTORIO"]
[null,null,null,null,null,null,null,null,null,null,null,null,null,null,null,"2017-07-23",null,null,null,null,null,null,null,null,null,null,57.8999999999998,"NO SATISFACTORIO"]
[null,null,null,null,null,null,null,null,null,null,null,null,null,null,null,"2017-07-24",null,null,null,null,null,null,null,null,null,null,57.999999999999801,"NO SATISFACTORIO"]
[null,null,null,null,null,null,null,null,null,null,null,null,null,null,null,"2017-07-25",null,null,null,null,null,null,null,null,null,null,58.099999999999802,"NO SATISFACTORIO"]
[null,null,null,null,null,null,null,null,null,null,null,null,null,null,null,"2017-07-26",null,null,null,null,null,null,null,null,null,null,58.199999999999797,"NO SATISFACTORIO"]
[null,null,null,null,null,null,null,null,null,null,null,null,null,null,null,"2017-07-27",null,null,null,null,null,null,null,null,null,null,58.299999999999798,"NO SATISFACTORIO"]
[null,null,null,null,null,null,null,null,null,null,null,null,null,null,null,"2017-07-28",null,null,null,null,null,null,null,null,null,null,58.3999999999998,"NO SATISFACTORIO"]
[null,null,null,null,null,null,null,null,null,null,null,null,null,null,null,"2017-07-29",null,null,null,null,null,null,null,null,null,null,58.499999999999801,"NO SATISFACTORIO"]
[null,null,null,null,null,null,null,null,null,null,null,null,null,null,null,"2017-07-30",null,null,null,null,null,null,null,null,null,null,58.599999999999802,"NO SATISFACTORIO"]
[null,null,null,null,null,null,null,null,null,null,null,null,null,null,null,"2017-07-31",null,null,null,null,null,null,null,null,null,null,58.699999999999797,"NO SATISFACTORIO"]
[null,null,null,null,null,null,null,null,null,null,null,null,null,null,null,"2017-08-01",null,null,null,null,null,null,null,null,null,null,58.799999999999798,"NO SATISFACTORIO"]
[null,null,null,null,null,null,null,null,null,null,null,null,null,null,null,"2017-08-02",null,null,null,null,null,null,null,null,null,null,58.8999999999998,"NO SATISFACTORIO"]
[null,null,null,null,null,null,null,null,null,null,null,null,null,null,null,"2017-08-03",null,null,null,null,null,null,null,null,null,null,58.999999999999801,"NO SATISFACTORIO"]
[null,null,null,null,null,null,null,null,null,null,null,null,null,null,null,"2017-08-04",null,null,null,null,null,null,null,null,null,null,59.099999999999802,"NO SATISFACTORIO"]
[null,null,null,null,null,null,null,null,null,null,null,null,null,null,null,"2017-08-05",null,null,null,null,null,null,null,null,null,null,59.199999999999797,"NO SATISFACTORIO"]
[null,null,null,null,null,null,null,null,null,null,null,null,null,null,null,"2017-08-06",null,null,null,null,null,null,null,null,null,null,59.299999999999798,"NO SATISFACTORIO"]
[null,null,null,null,null,null,null,null,null,null,null,null,null,null,null,"2017-08-07",null,null,null,null,null,null,null,null,null,null,59.3999999999998,"NO SATISFACTORIO"]
[null,null,null,null,null,null,null,null,null,null,null,null,null,null,null,"2017-08-08",null,null,null,null,null,null,null,null,null,null,59.499999999999801,"NO SATISFACTORIO"]
[null,null,null,null,null,null,null,null,null,null,null,null,null,null,null,"2017-08-09",null,null,null,null,null,null,null,null,null,null,59.599999999999802,"NO SATISFACTORIO"]
[null,null,null,null,null,null,null,null,null,null,null,null,null,null,null,"2017-08-10",null,null,null,null,null,null,null,null,null,null,59.699999999999797,"NO SATISFACTORIO"]
["NIVEL","Competencia","Concatenar","Definición de la competencia","Conductas asociadas",null,null,null,null,null,null,null,null,null,null,"2017-08-11",null,null,null,null,null,null,null,null,null,null,59.799999999999798,"NO SATISFACTORIO"]
["ASESOR","Orientación a resultados ",{"$f":"A601&B601","v":"ASESOROrientación a resultados "},"Realizar las funciones y cumplir los compromisos organizacionales con eficacia y calidad. ","▪ Cumple con oportunidad en función de estándares, objetivos y metas establecidas por la entidad, las funciones que le son asignadas.\n▪ Asume la responsabilidad por sus resultados.\n▪ Compromete recursos y tiempos para mejorar la productividad tomando las medidas necesarias para minimizar los riesgos.\n▪ Realiza todas las acciones necesarias para alcanzar los objetivos propuestos enfrentando los obstáculos que se presentan.",null,null,null,null,null,null,null,null,null,null,"2017-08-12",null,null,null,null,null,null,null,null,null,null,59.8999999999998,"NO SATISFACTORIO"]
["ASESOR","Orientación al usuario y al ciudadano",{"$f":"A602&B602","v":"ASESOROrientación al usuario y al ciudadano"},"Dirigir las decisiones y acciones a la satisfacción de las necesidades e intereses de los usuarios internos y externos, de conformidad con las responsabilidades públicas asignadas a la entidad.","▪ Atiende y valora las necesidades y peticiones de los usuarios y de ciudadanos en general.\n▪Considera las necesidades de los usuarios al diseñar proyectos o servicios.\n▪Da respuesta oportuna a las necesidades de los usuarios de conformidad con el servicio que ofrece la entidad.\n▪Establece diferentes canales de comunicación con el usuario para conocer sus necesidades y propuestas y responde a las mismas.\n▪Reconoce la interdependencia entre su trabajo y el de otros.",null,null,null,null,null,null,null,null,null,null,"2017-08-13",null,null,null,null,null,null,null,null,null,null,59.999999999999801,"NO SATISFACTORIO"]
["ASESOR","Compromiso con la Organización","ASESORCompromiso con la Organización","Alinear el propio comportamiento a las necesidades, prioridades y metas organizacionales.","▪Promueve las metas de la organización y respeta sus normas.\n▪Antepone las necesidades de la organización a sus propias necesidades.\n▪Apoya a la organización en situaciones difíciles.\n▪Demuestra sentido de pertenencia en todas sus actuaciones.",null,null,null,null,null,null,null,null,null,null,"2017-08-14",null,null,null,null,null,null,null,null,null,null,60.099999999999802,"NO SATISFACTORIO"]
["ASESOR","Experticia profesional","ASESORExperticia profesional","Aplicar el conocimiento profesional","▪Orienta el desarrollo de proyectos especiales para el logro de resultados de la alta dirección.\n▪Aconseja y orienta la toma de decisiones en los temas que le han sido asignados.\n▪Asesora en materias propias de su campo de conocimiento, emitiendo conceptos, juicios o propuestas ajustados a lineamientos teóricos y técnicos.\n▪Se comunica de modo lógico, claro, efectivo y seguro.",null,null,null,null,null,null,null,null,null,null,"2017-08-15",null,null,null,null,null,null,null,null,null,null,60.199999999999797,"NO SATISFACTORIO"]
["ASESOR","Conocimiento del entorno","ASESORConocimiento del entorno","Conocer e interpretar la organización, su funcionamiento y sus relaciones políticas y administrativas.","▪Comprende el entorno organizacional que enmarca las situaciones objeto de asesoría y lo toma como referente obligado para emitir juicios, conceptos o propuestas a desarrollar.\n▪Se informa permanentemente sobre políticas gubernamentales, problemas y demandas del entorno.",null,null,null,null,null,null,null,null,null,null,"2017-08-16",null,null,null,null,null,null,null,null,null,null,60.299999999999798,"NO SATISFACTORIO"]
["ASESOR","Construcción de relaciones","ASESORConstrucción de relaciones","Establecer y mantener relaciones cordiales y recíprocas con redes o grupos de personas internas y externas a la organización que faciliten la consecución de los objetivos institucionales.","▪Utiliza sus contactos para conseguir objetivos.\n▪Comparte información para establecer lazos.\n▪Interactúa con otros de un modo efectivo y adecuado.",null,null,null,null,null,null,null,null,null,null,"2017-08-17",null,null,null,null,null,null,null,null,null,null,60.3999999999998,"NO SATISFACTORIO"]
["ASESOR","Iniciativa","ASESORIniciativa","Anticiparse a los problemas iniciando acciones para superar los obstáculos y alcanzar metas concretas","▪Prevé situaciones y alternativas de solución que orientan la toma de decisiones de la alta dirección.\n▪Enfrenta los problemas y propone acciones concretas para solucionarlos.\n▪Reconoce y hace viables las oportunidades.",null,null,null,null,null,null,null,null,null,null,"2017-08-18",null,null,null,null,null,null,null,null,null,null,60.499999999999801,"NO SATISFACTORIO"]
["PROFESIONAL","Orientación a resultados ","PROFESIONALOrientación a resultados ","Realizar las funciones y cumplir los compromisos organizacionales con eficacia y calidad. ","▪ Cumple con oportunidad en función de estándares, objetivos y metas establecidas por la entidad, las funciones que le son asignadas.\n▪ Asume la responsabilidad por sus resultados.\n▪ Compromete recursos y tiempos para mejorar la productividad tomando las medidas necesarias para minimizar los riesgos.\n▪ Realiza todas las acciones necesarias para alcanzar los objetivos propuestos enfrentando los obstáculos que se presentan.",null,null,null,null,null,null,null,null,null,null,"2017-08-19",null,null,null,null,null,null,null,null,null,null,60.599999999999802,"NO SATISFACTORIO"]
["PROFESIONAL","Orientación al usuario y al ciudadano","PROFESIONALOrientación al usuario y al ciudadano","Dirigir las decisiones y acciones a la satisfacción de las necesidades e intereses de los usuarios internos y externos, de conformidad con las responsabilidades públicas asignadas a la entidad.","▪ Atiende y valora las necesidades y peticiones de los usuarios y de ciudadanos en general.\n▪Considera las necesidades de los usuarios al diseñar proyectos o servicios.\n▪Da respuesta oportuna a las necesidades de los usuarios de conformidad con el servicio que ofrece la entidad.\n▪Establece diferentes canales de comunicación con el usuario para conocer sus necesidades y propuestas y responde a las mismas.\n▪Reconoce la interdependencia entre su trabajo y el de otros.",null,null,null,null,null,null,null,null,null,null,"2017-08-20",null,null,null,null,null,null,null,null,null,null,60.699999999999797,"NO SATISFACTORIO"]
["PROFESIONAL","Compromiso con la Organización","PROFESIONALCompromiso con la Organización","Alinear el propio comportamiento a las necesidades, prioridades y metas organizacionales.","▪Promueve las metas de la organización y respeta sus normas.\n▪Antepone las necesidades de la organización a sus propias necesidades.\n▪Apoya a la organización en situaciones difíciles.\n▪Demuestra sentido de pertenencia en todas sus actuaciones.",null,null,null,null,null,null,null,null,null,null,"2017-08-21",null,null,null,null,null,null,null,null,null,null,60.799999999999798,"NO SATISFACTORIO"]
["PROFESIONAL","Aprendizaje Continuo","PROFESIONALAprendizaje Continuo","Adquirir y desarrollar permanentemente conocimientos, destrezas y habilidades, con el fin de mantener altos estándares de eficacia organizacional.","▪Aprende de la experiencia de otros y de la propia.\n▪Se adapta y aplica nuevas tecnologías que se implanten en la organización.\n▪Aplica los conocimientos adquiridos a los desafíos que se presentan en el desarrollo del trabajo.\n▪Investiga, indaga y profundiza en los temas de su entorno área de desempeño.\n▪Reconoce las propias limitaciones y las necesidades de mejorar su preparación.\n▪Asimila nueva información y la aplica correctamente.",null,null,null,null,null,null,null,null,null,null,"2017-08-22",null,null,null,null,null,null,null,null,null,null,60.8999999999998,"NO SATISFACTORIO"]
["PROFESIONAL","Experticia profesional","PROFESIONALExperticia profesional","Aplicar el conocimiento profesional en la resolución de problemas y transferirlo a su entorno laboral.","▪Analiza de un modo sistemático y racional los aspectos del trabajo, basándose en la información relevante.\n▪Aplica reglas básicas y conceptos complejos aprendidos\n▪Identifica y reconoce con facilidad las causas de los problemas y sus soluciones.\n▪Clarifica datos o situaciones complejas.\n▪Planea, organiza y ejecuta múltiples tareas tendientes a alcanzar resultados institucionales.",null,null,null,null,null,null,null,null,null,null,"2017-08-23",null,null,null,null,null,null,null,null,null,null,60.999999999999801,"NO SATISFACTORIO"]
["PROFESIONAL","Trabajo en equipo y Colaboración","PROFESIONALTrabajo en equipo y Colaboración","Trabajar con otros de forma conjunta y de manera participativa, integrando esfuerzos para la consecución de metas institucionales comunes.","▪Coopera en distintas situaciones y comparte información.\n▪Aporta sugerencias, ideas y opiniones.\n▪Expresa expectativas positivas del equipo o de los miembros del mismo.\n▪Planifica las propias acciones teniendo en cuenta la repercusión de las mismas para la consecución de los objetivos grupales.\n▪Establece diálogo directo con los miembros del equipo que permita compartir información e ideas en condiciones de respeto y cordialidad.\n▪Respeta criterios dispares y distintas opiniones del equipo.",null,null,null,null,null,null,null,null,null,null,"2017-08-24",null,null,null,null,null,null,null,null,null,null,61.099999999999802,"NO SATISFACTORIO"]
["PROFESIONAL","Creatividad e Innovación","PROFESIONALCreatividad e Innovación","Generar y desarrollar nuevas ideas, conceptos, métodos y soluciones.","▪Ofrece respuestas alternativas.\n▪Aprovecha las oportunidades y problemas para dar soluciones novedosas.\n▪Desarrolla nuevas formas de hacer y tecnologías.\n▪Busca nuevas alternativas de solución y se arriesga a romper esquemas tradicionales.\n▪Inicia acciones para superar los obstáculos y alcanzar metas específicas.",null,null,null,null,null,null,null,null,null,null,"2017-08-25",null,null,null,null,null,null,null,null,null,null,61.199999999999797,"NO SATISFACTORIO"]
["PROFESIONAL","Liderazgo de Grupos de Trabajo (personal a cargo)","PROFESIONALLiderazgo de Grupos de Trabajo (personal a cargo)","Asumir el rol de orientar y guía de un grupo o equipo de trabajo, utilizando la autoridad con arreglo a las normas y promoviendo la Efectividad en la consecución de objetivos y metas institucionales.","▪Establece los objetivos del grupo de forma clara y equilibrada.\n▪Asegura que los integrantes del grupo compartan planes, programas y proyectos institucionales.\n▪Orienta y coordina el trabajo del grupo para la identificación de planes y actividades a seguir.\n▪Facilita la colaboración con otras áreas y dependencias.\n▪Escucha y tiene en cuenta las opiniones de los integrantes del grupo.\n▪Gestiona los recursos necesarios para poder cumplir con las metas propuestas.\n▪Garantiza los recursos necesarios para poder cumplir con las metas propuestas.\n▪Garantiza que el grupo tenga la información necesaria.\n▪Explica las razones de las decisiones.",null,null,null,null,null,null,null,null,null,null,"2017-08-26",null,null,null,null,null,null,null,null,null,null,61.299999999999798,"NO SATISFACTORIO"]
["PROFESIONAL","Toma de decisiones (personal a cargo)","PROFESIONALToma de decisiones (personal a cargo)","Elegir entre una o varias alternativas para solucionar un problema y tomar las acciones concretas y consecuentes con la elección realizada.","▪Elige alternativas de solución efectiva y suficiente para atender los asuntos encomendados.\n▪Decide y establece prioridades para el trabajo del grupo.\n▪Asume posiciones concretas para el manejo de temas o situaciones que demandan su atención.\n▪Efectúa cambios en las actividades o en la manera de desarrollar sus responsabilidades cuando detecta dificultades para su realización o mejores prácticas que pueden optimizar el desempeño.\n▪Asume las consecuencias de las decisiones adoptadas.\n▪Fomenta la participación en la toma de decisiones.",null,null,null,null,null,null,null,null,null,null,"2017-08-27",null,null,null,null,null,null,null,null,null,null,61.3999999999998,"NO SATISFACTORIO"]
["TECNICO","Orientación a resultados ","TECNICOOrientación a resultados ","Realizar las funciones y cumplir los compromisos organizacionales con eficacia y calidad. ","▪ Cumple con oportunidad en función de estándares, objetivos y metas establecidas por la entidad, las funciones que le son asignadas.\n▪ Asume la responsabilidad por sus resultados.\n▪ Compromete recursos y tiempos para mejorar la productividad tomando las medidas necesarias para minimizar los riesgos.\n▪ Realiza todas las acciones necesarias para alcanzar los objetivos propuestos enfrentando los obstáculos que se presentan.",null,null,null,null,null,null,null,null,null,null,"2017-08-28",null,null,null,null,null,null,null,null,null,null,61.499999999999801,"NO SATISFACTORIO"]
["TECNICO","Orientación al usuario y al ciudadano","TECNICOOrientación al usuario y al ciudadano","Dirigir las decisiones y acciones a la satisfacción de las necesidades e intereses de los usuarios internos y externos, de conformidad con las responsabilidades públicas asignadas a la entidad.","▪ Atiende y valora las necesidades y peticiones de los usuarios y de ciudadanos en general.\n▪Considera las necesidades de los usuarios al diseñar proyectos o servicios.\n▪Da respuesta oportuna a las necesidades de los usuarios de conformidad con el servicio que ofrece la entidad.\n▪Establece diferentes canales de comunicación con el usuario para conocer sus necesidades y propuestas y responde a las mismas.\n▪Reconoce la interdependencia entre su trabajo y el de otros.",null,null,null,null,null,null,null,null,null,null,"2017-08-29",null,null,null,null,null,null,null,null,null,null,61.599999999999802,"NO SATISFACTORIO"]
["TECNICO","Compromiso con la Organización","TECNICOCompromiso con la Organización","Alinear el propio comportamiento a las necesidades, prioridades y metas organizacionales.","▪Promueve las metas de la organización y respeta sus normas.\n▪Antepone las necesidades de la organización a sus propias necesidades.\n▪Apoya a la organización en situaciones difíciles.\n▪Demuestra sentido de pertenencia en todas sus actuaciones.",null,null,null,null,null,null,null,null,null,null,"2017-08-30",null,null,null,null,null,null,null,null,null,null,61.699999999999797,"NO SATISFACTORIO"]
["TECNICO","Experticia Técnica","TECNICOExperticia Técnica","Entender y aplicar los conocimientos técnicos del área de desempeño y mantenerlos actualizados","▪Capta y asimila con facilidad conceptos e información.\n▪Aplica el conocimiento técnico a las actividades cotidianas.\n▪Analiza la información de acuerdo con las necesidades de la organización.\n▪Comprende los aspectos técnicos y los aplica al desarrollo de procesos y procedimientos en los que está involucrado.\n▪Resuelve problemas utilizando sus conocimientos técnicos de su especialidad y garantizando indicadores y estándares establecidos.",null,null,null,null,null,null,null,null,null,null,"2017-08-31",null,null,null,null,null,null,null,null,null,null,61.799999999999798,"NO SATISFACTORIO"]
["TECNICO","Trabajo en equipo","TECNICOTrabajo en equipo","Trabajar con otros para conseguir metas comunes","▪Identifica claramente los objetivos del grupo y orienta su trabajo a la consecución de los mismos.\n▪Colabora con otros para la realización de actividades y metas grupales.",null,null,null,null,null,null,null,null,null,null,"2017-09-01",null,null,null,null,null,null,null,null,null,null,61.8999999999998,"NO SATISFACTORIO"]
["TECNICO","Creatividad e innovación","TECNICOCreatividad e innovación","Presentar ideas y métodos novedosos y concretarlos en acciones","▪Propone y encuentra formas nuevas y eficaces de hacer las cosas.\n▪Es recursivo.\n▪Es práctico.\n▪Busca nuevas alternativas de solución.\n▪Revisa permanentemente los procesos y procedimientos para optimizar los resultados.",null,null,null,null,null,null,null,null,null,null,"2017-09-02",null,null,null,null,null,null,null,null,null,null,61.999999999999801,"NO SATISFACTORIO"]
["ASISTENCIAL","Orientación a resultados ","ASISTENCIALOrientación a resultados ","Realizar las funciones y cumplir los compromisos organizacionales con eficacia y calidad. ","▪ Cumple con oportunidad en función de estándares, objetivos y metas establecidas por la entidad, las funciones que le son asignadas.\n▪ Asume la responsabilidad por sus resultados.\n▪ Compromete recursos y tiempos para mejorar la productividad tomando las medidas necesarias para minimizar los riesgos.\n▪ Realiza todas las acciones necesarias para alcanzar los objetivos propuestos enfrentando los obstáculos que se presentan.",null,null,null,null,null,null,null,null,null,null,"2017-09-03",null,null,null,null,null,null,null,null,null,null,62.099999999999802,"NO SATISFACTORIO"]
["ASISTENCIAL","Orientación al usuario y al ciudadano","ASISTENCIALOrientación al usuario y al ciudadano","Dirigir las decisiones y acciones a la satisfacción de las necesidades e intereses de los usuarios internos y externos, de conformidad con las responsabilidades públicas asignadas a la entidad.","▪ Atiende y valora las necesidades y peticiones de los usuarios y de ciudadanos en general.\n▪Considera las necesidades de los usuarios al diseñar proyectos o servicios.\n▪Da respuesta oportuna a las necesidades de los usuarios de conformidad con el servicio que ofrece la entidad.\n▪Establece diferentes canales de comunicación con el usuario para conocer sus necesidades y propuestas y responde a las mismas.\n▪Reconoce la interdependencia entre su trabajo y el de otros.",null,null,null,null,null,null,null,null,null,null,"2017-09-04",null,null,null,null,null,null,null,null,null,null,62.199999999999797,"NO SATISFACTORIO"]
["ASISTENCIAL","Compromiso con la Organización","ASISTENCIALCompromiso con la Organización","Alinear el propio comportamiento a las necesidades, prioridades y metas organizacionales.","▪Promueve las metas de la organización y respeta sus normas.\n▪Antepone las necesidades de la organización a sus propias necesidades.\n▪Apoya a la organización en situaciones difíciles.\n▪Demuestra sentido de pertenencia en todas sus actuaciones.",null,null,null,null,null,null,null,null,null,null,"2017-09-05",null,null,null,null,null,null,null,null,null,null,62.299999999999798,"NO SATISFACTORIO"]
["ASISTENCIAL","Manejo de la información","ASISTENCIALManejo de la información","Manejar con respeto las informaciones personales e institucionales de que dispone.","▪Evade temas que indagan sobre información confidencial.\n▪Recoge sólo información imprescindible para el desarrollo de la tarea.\n▪Organiza y guarda de forma adecuada la información a su cuidado, teniendo en cuenta las normas legales y de la organización.\n▪No hace pública información laboral o de las personas que pueda afectar la organización o las personas.",null,null,null,null,null,null,null,null,null,null,"2017-09-06",null,null,null,null,null,null,null,null,null,null,62.3999999999998,"NO SATISFACTORIO"]
["ASISTENCIAL","Adaptación al cambio","ASISTENCIALAdaptación al cambio","Enfrentarse con flexibilidad y versatilidad a situaciones nuevas para aceptar los cambios positiva y constructivamente.","▪Acepta y se adapta fácilmente los cambios.\n▪Responde al cambio con flexibilidad.\n▪Promueve el cambio.",null,null,null,null,null,null,null,null,null,null,"2017-09-07",null,null,null,null,null,null,null,null,null,null,62.499999999999801,"NO SATISFACTORIO"]
["ASISTENCIAL","Disciplina","ASISTENCIALDisciplina","Adaptarse a las políticas institucionales y buscar información de los cambios en la autoridad competente.","▪Acepta instrucciones aunque se difiera de ellas.\n▪Realiza los cometidos y tareas del puesto de trabajo.\n▪Acepta la supervisión constante.\n▪Realiza funciones orientadas a apoyar la acción de otros miembros de la organización.",null,null,null,null,null,null,null,null,null,null,"2017-09-08",null,null,null,null,null,null,null,null,null,null,62.599999999999802,"NO SATISFACTORIO"]
["ASISTENCIAL","Relaciones Interpersonales","ASISTENCIALRelaciones Interpersonales","Establecer y mantener relaciones de trabajo amistosas y positivas, basadas en la comunicación abierta y fluida y en el respeto por los demás.","▪Escucha con interés a las personas y capta las preocupaciones, intereses y necesidades de los demás.\n▪Transmite eficazmente las ideas, sentimientos e información impidiendo con ello malos entendidos o situaciones confusas que puedan generar conflictos.",null,null,null,null,null,null,null,null,null,null,"2017-09-09",null,null,null,null,null,null,null,null,null,null,62.699999999999797,"NO SATISFACTORIO"]
["ASISTENCIAL","Colaboración","ASISTENCIALColaboración","Cooperar con los demás con el fin de alcanzar los objetivos institucionales","▪Ayuda al logro de los objetivos articulando sus actuaciones con los demás.\n▪Cumple los compromisos que adquiere.\n▪Facilita la labor de sus superiores y compañeros de trabajo.",null,null,null,null,null,null,null,null,null,null,"2017-09-10",null,null,null,null,null,null,null,null,null,null,62.799999999999798,"NO SATISFACTORIO"]
["DIRECTIVO","Orientación a resultados ",{"$f":"A631&B631","v":"DIRECTIVOOrientación a resultados "},"Realizar las funciones y cumplir los compromisos organizacionales con eficacia y calidad. ","▪ Cumple con oportunidad en función de estándares, objetivos y metas establecidas por la entidad, las funciones que le son asignadas.\n▪ Asume la responsabilidad por sus resultados.\n▪ Compromete recursos y tiempos para mejorar la productividad tomando las medidas necesarias para minimizar los riesgos.\n▪ Realiza todas las acciones necesarias para alcanzar los objetivos propuestos enfrentando los obstáculos que se presentan.",null,null,null,null,null,null,null,null,null,null,"2017-09-11",null,null,null,null,null,null,null,null,null,null,62.8999999999998,"NO SATISFACTORIO"]
["DIRECTIVO","Orientación al usuario y al ciudadano",{"$f":"A632&B632","v":"DIRECTIVOOrientación al usuario y al ciudadano"},"Dirigir las decisiones y acciones a la satisfacción de las necesidades e intereses de los usuarios internos y externos, de conformidad con las responsabilidades públicas asignadas a la entidad.","▪ Atiende y valora las necesidades y peticiones de los usuarios y de ciudadanos en general.\n▪Considera las necesidades de los usuarios al diseñar proyectos o servicios.\n▪Da respuesta oportuna a las necesidades de los usuarios de conformidad con el servicio que ofrece la entidad.\n▪Establece diferentes canales de comunicación con el usuario para conocer sus necesidades y propuestas y responde a las mismas.\n▪Reconoce la interdependencia entre su trabajo y el de otros.",null,null,null,null,null,null,null,null,null,null,"2017-09-12",null,null,null,null,null,null,null,null,null,null,62.999999999999801,"NO SATISFACTORIO"]
["DIRECTIVO","Compromiso con la Organización","DIRECTIVOCompromiso con la Organización","Alinear el propio comportamiento a las necesidades, prioridades y metas organizacionales.","▪Promueve las metas de la organización y respeta sus normas.\n▪Antepone las necesidades de la organización a sus propias necesidades.\n▪Apoya a la organización en situaciones difíciles.\n▪Demuestra sentido de pertenencia en todas sus actuaciones.",null,null,null,null,null,null,null,null,null,null,"2017-09-13",null,null,null,null,null,null,null,null,null,null,63.099999999999802,"NO SATISFACTORIO"]
["DIRECTIVO","Liderazgo","DIRECTIVOLiderazgo","Guiar y dirigir grupos y establecer y mantener la cohesión de grupo necesaria para alcanzar los objetivos organizacionales.","• Mantiene a sus colaboradores motivados.\n• Fomenta la comunicación clara, directa y concreta.\n• Constituye y mantiene grupos de trabajo con un desempeño conforme a los estándares.\n• Promueve la eficacia del equipo.\n• Genera un clima positivo y de seguridad en sus colaboradores.\n• Fomenta la participación de todos en los procesos de reflexión y de toma de decisiones.\n• Unifica esfuerzos hacia objetivos y metas institucionales.",null,null,null,null,null,null,null,null,null,null,"2017-09-14",null,null,null,null,null,null,null,null,null,null,63.199999999999797,"NO SATISFACTORIO"]
["DIRECTIVO","Planeación","DIRECTIVOPlaneación","Determinar eficazmente las metas y prioridades institucionales, identificando las acciones, los responsables, los plazos y los recursos requeridos para alcanzarlas.","• Anticipa situaciones y escenarios futuros con acierto.\n• Establece objetivos claros y concisos, estructurados y coherentes con las metas organizacionales.\n• Traduce los objetivos estratégicos en planes prácticos y factibles.\n• Busca soluciones a los problemas.\n• Distribuye el tiempo con eficiencia.\n• Establece planes alternativos de acción.",null,null,null,null,null,null,null,null,null,null,"2017-09-15",null,null,null,null,null,null,null,null,null,null,63.299999999999798,"NO SATISFACTORIO"]
["DIRECTIVO","Toma de decisiones","DIRECTIVOToma de decisiones","Elegir entre una o varias alternativas para solucionar un problema o atender una situación, comprometiéndose con acciones concretas y consecuentes con la decisión.","• Elige con oportunidad, entre muchas alternativas, los proyectos a realizar.\n• Efectúa cambios complejos y comprometidos en sus actividades o en las funciones que tiene asignadas cuando detecta problemas o dificultades para su realización.\n• Decide bajo presión.\n• Decide en situaciones de alta complejidad e incertidumbre.",null,null,null,null,null,null,null,null,null,null,"2017-09-16",null,null,null,null,null,null,null,null,null,null,63.3999999999998,"NO SATISFACTORIO"]
["DIRECTIVO","Dirección y Desarrollo de Personal","DIRECTIVODirección y Desarrollo de Personal","Favorecer el aprendizaje y desarrollo de sus colaboradores, articulando las potencialidades y necesidades individuales con las de la organización para optimizar la calidad de las contribuciones de los equipos de trabajo y de las personas, en el cumplimiento de los objetivos y metas organizacionales presentes y futuras.","• Identifica necesidades de formación y capacitación y propone acciones para satisfacerlas.\n• Permite niveles de autonomía con el fin de estimular el desarrollo integral del empleado.\n• Delega de manera efectiva sabiendo cuando intervenir y cuando no hacerlo.\n• Hace uso de las habilidades y recurso de su grupo de trabajo para alcanzar las metas y los estándares de productividad.\n• Establece espacios regulares de retroalimentación y reconocimiento del desempeño y sabe manejar hábilmente el bajo desempeño.\n• Tiene en cuenta las opiniones de sus colaboradores.\n• Mantiene con sus colaboradores relaciones de respeto.",null,null,null,null,null,null,null,null,null,null,"2017-09-17",null,null,null,null,null,null,null,null,null,null,63.499999999999801,"NO SATISFACTORIO"]
["DIRECTIVO","Conocimiento del entorno","DIRECTIVOConocimiento del entorno","Estar al tanto de las circunstancias y las relaciones de poder que influyen en el entorno organizacional","• Es consciente de las condiciones específicas del entorno organizacional.\n• Está al día en los acontecimientos claves del sector y del Estado.\n• Conoce y hace seguimiento a las políticas gubernamentales.\n• Identifica las fuerzas políticas que afectan la organización y las posibles alianzas para cumplir con los propósitos organizacionales.",null,null,null,null,null,null,null,null,null,null,"2017-09-18",null,null,null,null,null,null,null,null,null,null,63.599999999999802,"NO SATISFACTORIO"]
[null,null,null,null,null,null,null,null,null,null,null,null,null,null,null,"2017-09-19",null,null,null,null,null,null,null,null,null,null,63.699999999999797,"NO SATISFACTORIO"]
[null,null,null,null,null,null,null,null,null,null,null,null,null,null,null,"2017-09-20",null,null,null,null,null,null,null,null,null,null,63.799999999999798,"NO SATISFACTORIO"]
[null,null,null,null,null,null,null,null,null,null,null,null,null,null,null,"2017-09-21",null,null,null,null,null,null,null,null,null,null,63.8999999999998,"NO SATISFACTORIO"]
[null,null,null,null,null,null,null,null,null,null,null,null,null,null,null,"2017-09-22",null,null,null,null,null,null,null,null,null,null,63.999999999999801,"NO SATISFACTORIO"]
[null,null,null,null,null,null,null,null,null,null,null,null,null,null,null,"2017-09-23",null,null,null,null,null,null,null,null,null,null,64.099999999999795,"NO SATISFACTORIO"]
[null,null,null,null,null,null,null,null,null,null,null,null,null,null,null,"2017-09-24",null,null,null,null,null,null,null,null,null,null,64.199999999999804,"NO SATISFACTORIO"]
[null,null,null,null,null,null,null,null,null,null,null,null,null,null,null,"2017-09-25",null,null,null,null,null,null,null,null,null,null,64.299999999999798,"NO SATISFACTORIO"]
[null,null,null,null,null,null,null,null,null,null,null,null,null,null,null,"2017-09-26",null,null,null,null,null,null,null,null,null,null,64.399999999999807,"NO SATISFACTORIO"]
[null,null,null,null,null,null,null,null,null,null,null,null,null,null,null,"2017-09-27",null,null,null,null,null,null,null,null,null,null,64.499999999999801,"NO SATISFACTORIO"]
[null,null,null,null,null,null,null,null,null,null,null,null,null,null,null,"2017-09-28",null,null,null,null,null,null,null,null,null,null,64.599999999999795,"NO SATISFACTORIO"]
[null,null,null,null,null,null,null,null,null,null,null,null,null,null,null,"2017-09-29",null,null,null,null,null,null,null,null,null,null,64.699999999999804,"NO SATISFACTORIO"]
[null,null,null,null,null,null,null,null,null,null,null,null,null,null,null,"2017-09-30",null,null,null,null,null,null,null,null,null,null,64.799999999999798,"NO SATISFACTORIO"]
[null,null,null,null,null,null,null,null,null,null,null,null,null,null,null,"2017-10-01",null,null,null,null,null,null,null,null,null,null,64.899999999999807,"NO SATISFACTORIO"]
[null,null,null,null,null,null,null,null,null,null,null,null,null,null,null,"2017-10-02",null,null,null,null,null,null,null,null,null,null,64.999999999999801,"NO SATISFACTORIO"]
[null,null,null,null,null,null,null,null,null,null,null,null,null,null,null,"2017-10-03",null,null,null,null,null,null,null,null,null,null,65.010000000000005,"SATISFACTORIO"]
[null,null,null,null,null,null,null,null,null,null,null,null,null,null,null,"2017-10-04",null,null,null,null,null,null,null,null,null,null,65.199999999999804,"SATISFACTORIO"]
[null,null,null,null,null,null,null,null,null,null,null,null,null,null,null,"2017-10-05",null,null,null,null,null,null,null,null,null,null,65.299999999999798,"SATISFACTORIO"]
[null,null,null,null,null,null,null,null,null,null,null,null,null,null,null,"2017-10-06",null,null,null,null,null,null,null,null,null,null,65.399999999999807,"SATISFACTORIO"]
[null,null,null,null,null,null,null,null,null,null,null,null,null,null,null,"2017-10-07",null,null,null,null,null,null,null,null,null,null,65.499999999999801,"SATISFACTORIO"]
[null,null,null,null,null,null,null,null,null,null,null,null,null,null,null,"2017-10-08",null,null,null,null,null,null,null,null,null,null,65.599999999999795,"SATISFACTORIO"]
[null,null,null,null,null,null,null,null,null,null,null,null,null,null,null,"2017-10-09",null,null,null,null,null,null,null,null,null,null,65.699999999999804,"SATISFACTORIO"]
[null,null,null,null,null,null,null,null,null,null,null,null,null,null,null,"2017-10-10",null,null,null,null,null,null,null,null,null,null,65.799999999999798,"SATISFACTORIO"]
[null,null,null,null,null,null,null,null,null,null,null,null,null,null,null,"2017-10-11",null,null,null,null,null,null,null,null,null,null,65.899999999999807,"SATISFACTORIO"]
[null,null,null,null,null,null,null,null,null,null,null,null,null,null,null,"2017-10-12",null,null,null,null,null,null,null,null,null,null,65.999999999999801,"SATISFACTORIO"]
[null,null,null,null,null,null,null,null,null,null,null,null,null,null,null,"2017-10-13",null,null,null,null,null,null,null,null,null,null,66.099999999999795,"SATISFACTORIO"]
[null,null,null,null,null,null,null,null,null,null,null,null,null,null,null,"2017-10-14",null,null,null,null,null,null,null,null,null,null,66.199999999999804,"SATISFACTORIO"]
[null,null,null,null,null,null,null,null,null,null,null,null,null,null,null,"2017-10-15",null,null,null,null,null,null,null,null,null,null,66.299999999999798,"SATISFACTORIO"]
[null,null,null,null,null,null,null,null,null,null,null,null,null,null,null,"2017-10-16",null,null,null,null,null,null,null,null,null,null,66.399999999999807,"SATISFACTORIO"]
[null,null,null,null,null,null,null,null,null,null,null,null,null,null,null,"2017-10-17",null,null,null,null,null,null,null,null,null,null,66.499999999999801,"SATISFACTORIO"]
[null,null,null,null,null,null,null,null,null,null,null,null,null,null,null,"2017-10-18",null,null,null,null,null,null,null,null,null,null,66.599999999999795,"SATISFACTORIO"]
[null,null,null,null,null,null,null,null,null,null,null,null,null,null,null,"2017-10-19",null,null,null,null,null,null,null,null,null,null,66.699999999999804,"SATISFACTORIO"]
[null,null,null,null,null,null,null,null,null,null,null,null,null,null,null,"2017-10-20",null,null,null,null,null,null,null,null,null,null,66.799999999999798,"SATISFACTORIO"]
[null,null,null,null,null,null,null,null,null,null,null,null,null,null,null,"2017-10-21",null,null,null,null,null,null,null,null,null,null,66.899999999999807,"SATISFACTORIO"]
[null,null,null,null,null,null,null,null,null,null,null,null,null,null,null,"2017-10-22",null,null,null,null,null,null,null,null,null,null,66.999999999999801,"SATISFACTORIO"]
[null,null,null,null,null,null,null,null,null,null,null,null,null,null,null,"2017-10-23",null,null,null,null,null,null,null,null,null,null,67.099999999999795,"SATISFACTORIO"]
[null,null,null,null,null,null,null,null,null,null,null,null,null,null,null,"2017-10-24",null,null,null,null,null,null,null,null,null,null,67.199999999999804,"SATISFACTORIO"]
[null,null,null,null,null,null,null,null,null,null,null,null,null,null,null,"2017-10-25",null,null,null,null,null,null,null,null,null,null,67.299999999999798,"SATISFACTORIO"]
[null,null,null,null,null,null,null,null,null,null,null,null,null,null,null,"2017-10-26",null,null,null,null,null,null,null,null,null,null,67.399999999999807,"SATISFACTORIO"]
[null,null,null,null,null,null,null,null,null,null,null,null,null,null,null,"2017-10-27",null,null,null,null,null,null,null,null,null,null,67.499999999999801,"SATISFACTORIO"]
[null,null,null,null,null,null,null,null,null,null,null,null,null,null,null,"2017-10-28",null,null,null,null,null,null,null,null,null,null,67.599999999999795,"SATISFACTORIO"]
[null,null,null,null,null,null,null,null,null,null,null,null,null,null,null,"2017-10-29",null,null,null,null,null,null,null,null,null,null,67.699999999999804,"SATISFACTORIO"]
[null,null,null,null,null,null,null,null,null,null,null,null,null,null,null,"2017-10-30",null,null,null,null,null,null,null,null,null,null,67.799999999999798,"SATISFACTORIO"]
[null,null,null,null,null,null,null,null,null,null,null,null,null,null,null,"2017-10-31",null,null,null,null,null,null,null,null,null,null,67.899999999999807,"SATISFACTORIO"]
[null,null,null,null,null,null,null,null,null,null,null,null,null,null,null,"2017-11-01",null,null,null,null,null,null,null,null,null,null,67.999999999999801,"SATISFACTORIO"]
[null,null,null,null,null,null,null,null,null,null,null,null,null,null,null,"2017-11-02",null,null,null,null,null,null,null,null,null,null,68.099999999999795,"SATISFACTORIO"]
[null,null,null,null,null,null,null,null,null,null,null,null,null,null,null,"2017-11-03",null,null,null,null,null,null,null,null,null,null,68.199999999999804,"SATISFACTORIO"]
[null,null,null,null,null,null,null,null,null,null,null,null,null,null,null,"2017-11-04",null,null,null,null,null,null,null,null,null,null,68.299999999999798,"SATISFACTORIO"]
[null,null,null,null,null,null,null,null,null,null,null,null,null,null,null,"2017-11-05",null,null,null,null,null,null,null,null,null,null,68.399999999999807,"SATISFACTORIO"]
[null,null,null,null,null,null,null,null,null,null,null,null,null,null,null,"2017-11-06",null,null,null,null,null,null,null,null,null,null,68.499999999999801,"SATISFACTORIO"]
[null,null,null,null,null,null,null,null,null,null,null,null,null,null,null,"2017-11-07",null,null,null,null,null,null,null,null,null,null,68.599999999999795,"SATISFACTORIO"]
[null,null,null,null,null,null,null,null,null,null,null,null,null,null,null,"2017-11-08",null,null,null,null,null,null,null,null,null,null,68.699999999999804,"SATISFACTORIO"]
[null,null,null,null,null,null,null,null,null,null,null,null,null,null,null,"2017-11-09",null,null,null,null,null,null,null,null,null,null,68.799999999999798,"SATISFACTORIO"]
[null,null,null,null,null,null,null,null,null,null,null,null,null,null,null,"2017-11-10",null,null,null,null,null,null,null,null,null,null,68.899999999999807,"SATISFACTORIO"]
[null,null,null,null,null,null,null,null,null,null,null,null,null,null,null,"2017-11-11",null,null,null,null,null,null,null,null,null,null,68.999999999999801,"SATISFACTORIO"]
[null,null,null,null,null,null,null,null,null,null,null,null,null,null,null,"2017-11-12",null,null,null,null,null,null,null,null,null,null,69.099999999999795,"SATISFACTORIO"]
[null,null,null,null,null,null,null,null,null,null,null,null,null,null,null,"2017-11-13",null,null,null,null,null,null,null,null,null,null,69.199999999999804,"SATISFACTORIO"]
[null,null,null,null,null,null,null,null,null,null,null,null,null,null,null,"2017-11-14",null,null,null,null,null,null,null,null,null,null,69.299999999999798,"SATISFACTORIO"]
[null,null,null,null,null,null,null,null,null,null,null,null,null,null,null,"2017-11-15",null,null,null,null,null,null,null,null,null,null,69.399999999999807,"SATISFACTORIO"]
[null,null,null,null,null,null,null,null,null,null,null,null,null,null,null,"2017-11-16",null,null,null,null,null,null,null,null,null,null,69.499999999999801,"SATISFACTORIO"]
[null,null,null,null,null,null,null,null,null,null,null,null,null,null,null,"2017-11-17",null,null,null,null,null,null,null,null,null,null,69.599999999999795,"SATISFACTORIO"]
[null,null,null,null,null,null,null,null,null,null,null,null,null,null,null,"2017-11-18",null,null,null,null,null,null,null,null,null,null,69.699999999999804,"SATISFACTORIO"]
[null,null,null,null,null,null,null,null,null,null,null,null,null,null,null,"2017-11-19",null,null,null,null,null,null,null,null,null,null,69.799999999999798,"SATISFACTORIO"]
[null,null,null,null,null,null,null,null,null,null,null,null,null,null,null,"2017-11-20",null,null,null,null,null,null,null,null,null,null,69.899999999999807,"SATISFACTORIO"]
[null,null,null,null,null,null,null,null,null,null,null,null,null,null,null,"2017-11-21",null,null,null,null,null,null,null,null,null,null,69.999999999999801,"SATISFACTORIO"]
[null,null,null,null,null,null,null,null,null,null,null,null,null,null,null,"2017-11-22",null,null,null,null,null,null,null,null,null,null,70.099999999999795,"SATISFACTORIO"]
[null,null,null,null,null,null,null,null,null,null,null,null,null,null,null,"2017-11-23",null,null,null,null,null,null,null,null,null,null,70.199999999999804,"SATISFACTORIO"]
[null,null,null,null,null,null,null,null,null,null,null,null,null,null,null,"2017-11-24",null,null,null,null,null,null,null,null,null,null,70.299999999999798,"SATISFACTORIO"]
[null,null,null,null,null,null,null,null,null,null,null,null,null,null,null,"2017-11-25",null,null,null,null,null,null,null,null,null,null,70.399999999999807,"SATISFACTORIO"]
[null,null,null,null,null,null,null,null,null,null,null,null,null,null,null,"2017-11-26",null,null,null,null,null,null,null,null,null,null,70.499999999999801,"SATISFACTORIO"]
[null,null,null,null,null,null,null,null,null,null,null,null,null,null,null,"2017-11-27",null,null,null,null,null,null,null,null,null,null,70.599999999999795,"SATISFACTORIO"]
[null,null,null,null,null,null,null,null,null,null,null,null,null,null,null,"2017-11-28",null,null,null,null,null,null,null,null,null,null,70.699999999999804,"SATISFACTORIO"]
[null,null,null,null,null,null,null,null,null,null,null,null,null,null,null,"2017-11-29",null,null,null,null,null,null,null,null,null,null,70.799999999999798,"SATISFACTORIO"]
[null,null,null,null,null,null,null,null,null,null,null,null,null,null,null,"2017-11-30",null,null,null,null,null,null,null,null,null,null,70.899999999999807,"SATISFACTORIO"]
[null,null,null,null,null,null,null,null,null,null,null,null,null,null,null,"2017-12-01",null,null,null,null,null,null,null,null,null,null,70.999999999999801,"SATISFACTORIO"]
[null,null,null,null,null,null,null,null,null,null,null,null,null,null,null,"2017-12-02",null,null,null,null,null,null,null,null,null,null,71.099999999999795,"SATISFACTORIO"]
[null,null,null,null,null,null,null,null,null,null,null,null,null,null,null,"2017-12-03",null,null,null,null,null,null,null,null,null,null,71.199999999999804,"SATISFACTORIO"]
[null,null,null,null,null,null,null,null,null,null,null,null,null,null,null,"2017-12-04",null,null,null,null,null,null,null,null,null,null,71.299999999999798,"SATISFACTORIO"]
[null,null,null,null,null,null,null,null,null,null,null,null,null,null,null,"2017-12-05",null,null,null,null,null,null,null,null,null,null,71.399999999999807,"SATISFACTORIO"]
[null,null,null,null,null,null,null,null,null,null,null,null,null,null,null,"2017-12-06",null,null,null,null,null,null,null,null,null,null,71.499999999999801,"SATISFACTORIO"]
[null,null,null,null,null,null,null,null,null,null,null,null,null,null,null,"2017-12-07",null,null,null,null,null,null,null,null,null,null,71.599999999999795,"SATISFACTORIO"]
[null,null,null,null,null,null,null,null,null,null,null,null,null,null,null,"2017-12-08",null,null,null,null,null,null,null,null,null,null,71.699999999999804,"SATISFACTORIO"]
[null,null,null,null,null,null,null,null,null,null,null,null,null,null,null,"2017-12-09",null,null,null,null,null,null,null,null,null,null,71.799999999999798,"SATISFACTORIO"]
[null,null,null,null,null,null,null,null,null,null,null,null,null,null,null,"2017-12-10",null,null,null,null,null,null,null,null,null,null,71.899999999999807,"SATISFACTORIO"]
[null,null,null,null,null,null,null,null,null,null,null,null,null,null,null,"2017-12-11",null,null,null,null,null,null,null,null,null,null,71.999999999999801,"SATISFACTORIO"]
[null,null,null,null,null,null,null,null,null,null,null,null,null,null,null,"2017-12-12",null,null,null,null,null,null,null,null,null,null,72.099999999999795,"SATISFACTORIO"]
[null,null,null,null,null,null,null,null,null,null,null,null,null,null,null,"2017-12-13",null,null,null,null,null,null,null,null,null,null,72.199999999999804,"SATISFACTORIO"]
[null,null,null,null,null,null,null,null,null,null,null,null,null,null,null,"2017-12-14",null,null,null,null,null,null,null,null,null,null,72.299999999999798,"SATISFACTORIO"]
[null,null,null,null,null,null,null,null,null,null,null,null,null,null,null,"2017-12-15",null,null,null,null,null,null,null,null,null,null,72.399999999999807,"SATISFACTORIO"]
[null,null,null,null,null,null,null,null,null,null,null,null,null,null,null,"2017-12-16",null,null,null,null,null,null,null,null,null,null,72.499999999999801,"SATISFACTORIO"]
[null,null,null,null,null,null,null,null,null,null,null,null,null,null,null,"2017-12-17",null,null,null,null,null,null,null,null,null,null,72.599999999999795,"SATISFACTORIO"]
[null,null,null,null,null,null,null,null,null,null,null,null,null,null,null,"2017-12-18",null,null,null,null,null,null,null,null,null,null,72.699999999999804,"SATISFACTORIO"]
[null,null,null,null,null,null,null,null,null,null,null,null,null,null,null,"2017-12-19",null,null,null,null,null,null,null,null,null,null,72.799999999999798,"SATISFACTORIO"]
[null,null,null,null,null,null,null,null,null,null,null,null,null,null,null,"2017-12-20",null,null,null,null,null,null,null,null,null,null,72.899999999999807,"SATISFACTORIO"]
[null,null,null,null,null,null,null,null,null,null,null,null,null,null,null,"2017-12-21",null,null,null,null,null,null,null,null,null,null,72.999999999999801,"SATISFACTORIO"]
[null,null,null,null,null,null,null,null,null,null,null,null,null,null,null,"2017-12-22",null,null,null,null,null,null,null,null,null,null,73.099999999999795,"SATISFACTORIO"]
[null,null,null,null,null,null,null,null,null,null,null,null,null,null,null,"2017-12-23",null,null,null,null,null,null,null,null,null,null,73.199999999999804,"SATISFACTORIO"]
[null,null,null,null,null,null,null,null,null,null,null,null,null,null,null,"2017-12-24",null,null,null,null,null,null,null,null,null,null,73.299999999999798,"SATISFACTORIO"]
[null,null,null,null,null,null,null,null,null,null,null,null,null,null,null,"2017-12-25",null,null,null,null,null,null,null,null,null,null,73.399999999999807,"SATISFACTORIO"]
[null,null,null,null,null,null,null,null,null,null,null,null,null,null,null,"2017-12-26",null,null,null,null,null,null,null,null,null,null,73.499999999999801,"SATISFACTORIO"]
[null,null,null,null,null,null,null,null,null,null,null,null,null,null,null,"2017-12-27",null,null,null,null,null,null,null,null,null,null,73.599999999999795,"SATISFACTORIO"]
[null,null,null,null,null,null,null,null,null,null,null,null,null,null,null,"2017-12-28",null,null,null,null,null,null,null,null,null,null,73.699999999999804,"SATISFACTORIO"]
[null,null,null,null,null,null,null,null,null,null,null,null,null,null,null,"2017-12-29",null,null,null,null,null,null,null,null,null,null,73.799999999999798,"SATISFACTORIO"]
[null,null,null,null,null,null,null,null,null,null,null,null,null,null,null,"2017-12-30",null,null,null,null,null,null,null,null,null,null,73.899999999999807,"SATISFACTORIO"]
[null,null,null,null,null,null,null,null,null,null,null,null,null,null,null,"2017-12-31",null,null,null,null,null,null,null,null,null,null,73.999999999999801,"SATISFACTORIO"]
[null,null,null,null,null,null,null,null,null,null,null,null,null,null,null,"2018-01-01",null,null,null,null,null,null,null,null,null,null,74.099999999999795,"SATISFACTORIO"]
[null,null,null,null,null,null,null,null,null,null,null,null,null,null,null,"2018-01-02",null,null,null,null,null,null,null,null,null,null,74.199999999999804,"SATISFACTORIO"]
[null,null,null,null,null,null,null,null,null,null,null,null,null,null,null,"2018-01-03",null,null,null,null,null,null,null,null,null,null,74.299999999999798,"SATISFACTORIO"]
[null,null,null,null,null,null,null,null,null,null,null,null,null,null,null,"2018-01-04",null,null,null,null,null,null,null,null,null,null,74.399999999999807,"SATISFACTORIO"]
[null,null,null,null,null,null,null,null,null,null,null,null,null,null,null,"2018-01-05",null,null,null,null,null,null,null,null,null,null,74.499999999999801,"SATISFACTORIO"]
[null,null,null,null,null,null,null,null,null,null,null,null,null,null,null,"2018-01-06",null,null,null,null,null,null,null,null,null,null,74.599999999999795,"SATISFACTORIO"]
[null,null,null,null,null,null,null,null,null,null,null,null,null,null,null,"2018-01-07",null,null,null,null,null,null,null,null,null,null,74.699999999999804,"SATISFACTORIO"]
[null,null,null,null,null,null,null,null,null,null,null,null,null,null,null,"2018-01-08",null,null,null,null,null,null,null,null,null,null,74.799999999999798,"SATISFACTORIO"]
[null,null,null,null,null,null,null,null,null,null,null,null,null,null,null,"2018-01-09",null,null,null,null,null,null,null,null,null,null,74.899999999999807,"SATISFACTORIO"]
[null,null,null,null,null,null,null,null,null,null,null,null,null,null,null,"2018-01-10",null,null,null,null,null,null,null,null,null,null,74.999999999999801,"SATISFACTORIO"]
[null,null,null,null,null,null,null,null,null,null,null,null,null,null,null,"2018-01-11",null,null,null,null,null,null,null,null,null,null,75.099999999999795,"SATISFACTORIO"]
[null,null,null,null,null,null,null,null,null,null,null,null,null,null,null,"2018-01-12",null,null,null,null,null,null,null,null,null,null,75.199999999999804,"SATISFACTORIO"]
[null,null,null,null,null,null,null,null,null,null,null,null,null,null,null,"2018-01-13",null,null,null,null,null,null,null,null,null,null,75.299999999999798,"SATISFACTORIO"]
[null,null,null,null,null,null,null,null,null,null,null,null,null,null,null,"2018-01-14",null,null,null,null,null,null,null,null,null,null,75.399999999999807,"SATISFACTORIO"]
[null,null,null,null,null,null,null,null,null,null,null,null,null,null,null,"2018-01-15",null,null,null,null,null,null,null,null,null,null,75.499999999999801,"SATISFACTORIO"]
[null,null,null,null,null,null,null,null,null,null,null,null,null,null,null,"2018-01-16",null,null,null,null,null,null,null,null,null,null,75.599999999999795,"SATISFACTORIO"]
[null,null,null,null,null,null,null,null,null,null,null,null,null,null,null,"2018-01-17",null,null,null,null,null,null,null,null,null,null,75.699999999999804,"SATISFACTORIO"]
[null,null,null,null,null,null,null,null,null,null,null,null,null,null,null,"2018-01-18",null,null,null,null,null,null,null,null,null,null,75.799999999999798,"SATISFACTORIO"]
[null,null,null,null,null,null,null,null,null,null,null,null,null,null,null,"2018-01-19",null,null,null,null,null,null,null,null,null,null,75.899999999999807,"SATISFACTORIO"]
[null,null,null,null,null,null,null,null,null,null,null,null,null,null,null,"2018-01-20",null,null,null,null,null,null,null,null,null,null,75.999999999999801,"SATISFACTORIO"]
[null,null,null,null,null,null,null,null,null,null,null,null,null,null,null,"2018-01-21",null,null,null,null,null,null,null,null,null,null,76.099999999999795,"SATISFACTORIO"]
[null,null,null,null,null,null,null,null,null,null,null,null,null,null,null,"2018-01-22",null,null,null,null,null,null,null,null,null,null,76.199999999999804,"SATISFACTORIO"]
[null,null,null,null,null,null,null,null,null,null,null,null,null,null,null,"2018-01-23",null,null,null,null,null,null,null,null,null,null,76.299999999999798,"SATISFACTORIO"]
[null,null,null,null,null,null,null,null,null,null,null,null,null,null,null,"2018-01-24",null,null,null,null,null,null,null,null,null,null,76.399999999999807,"SATISFACTORIO"]
[null,null,null,null,null,null,null,null,null,null,null,null,null,null,null,"2018-01-25",null,null,null,null,null,null,null,null,null,null,76.499999999999801,"SATISFACTORIO"]
[null,null,null,null,null,null,null,null,null,null,null,null,null,null,null,"2018-01-26",null,null,null,null,null,null,null,null,null,null,76.599999999999795,"SATISFACTORIO"]
[null,null,null,null,null,null,null,null,null,null,null,null,null,null,null,"2018-01-27",null,null,null,null,null,null,null,null,null,null,76.699999999999804,"SATISFACTORIO"]
[null,null,null,null,null,null,null,null,null,null,null,null,null,null,null,"2018-01-28",null,null,null,null,null,null,null,null,null,null,76.799999999999798,"SATISFACTORIO"]
[null,null,null,null,null,null,null,null,null,null,null,null,null,null,null,"2018-01-29",null,null,null,null,null,null,null,null,null,null,76.899999999999807,"SATISFACTORIO"]
[null,null,null,null,null,null,null,null,null,null,null,null,null,null,null,"2018-01-30",null,null,null,null,null,null,null,null,null,null,76.999999999999801,"SATISFACTORIO"]
[null,null,null,null,null,null,null,null,null,null,null,null,null,null,null,"2018-01-31",null,null,null,null,null,null,null,null,null,null,77.099999999999795,"SATISFACTORIO"]
[null,null,null,null,null,null,null,null,null,null,null,null,null,null,null,"2018-02-01",null,null,null,null,null,null,null,null,null,null,77.199999999999804,"SATISFACTORIO"]
[null,null,null,null,null,null,null,null,null,null,null,null,null,null,null,"2018-02-02",null,null,null,null,null,null,null,null,null,null,77.299999999999798,"SATISFACTORIO"]
[null,null,null,null,null,null,null,null,null,null,null,null,null,null,null,"2018-02-03",null,null,null,null,null,null,null,null,null,null,77.399999999999807,"SATISFACTORIO"]
[null,null,null,null,null,null,null,null,null,null,null,null,null,null,null,"2018-02-04",null,null,null,null,null,null,null,null,null,null,77.499999999999801,"SATISFACTORIO"]
[null,null,null,null,null,null,null,null,null,null,null,null,null,null,null,"2018-02-05",null,null,null,null,null,null,null,null,null,null,77.599999999999795,"SATISFACTORIO"]
[null,null,null,null,null,null,null,null,null,null,null,null,null,null,null,"2018-02-06",null,null,null,null,null,null,null,null,null,null,77.699999999999804,"SATISFACTORIO"]
[null,null,null,null,null,null,null,null,null,null,null,null,null,null,null,"2018-02-07",null,null,null,null,null,null,null,null,null,null,77.799999999999798,"SATISFACTORIO"]
[null,null,null,null,null,null,null,null,null,null,null,null,null,null,null,"2018-02-08",null,null,null,null,null,null,null,null,null,null,77.899999999999807,"SATISFACTORIO"]
[null,null,null,null,null,null,null,null,null,null,null,null,null,null,null,"2018-02-09",null,null,null,null,null,null,null,null,null,null,77.999999999999801,"SATISFACTORIO"]
[null,null,null,null,null,null,null,null,null,null,null,null,null,null,null,"2018-02-10",null,null,null,null,null,null,null,null,null,null,78.099999999999795,"SATISFACTORIO"]
[null,null,null,null,null,null,null,null,null,null,null,null,null,null,null,"2018-02-11",null,null,null,null,null,null,null,null,null,null,78.199999999999804,"SATISFACTORIO"]
[null,null,null,null,null,null,null,null,null,null,null,null,null,null,null,"2018-02-12",null,null,null,null,null,null,null,null,null,null,78.299999999999798,"SATISFACTORIO"]
[null,null,null,null,null,null,null,null,null,null,null,null,null,null,null,"2018-02-13",null,null,null,null,null,null,null,null,null,null,78.399999999999807,"SATISFACTORIO"]
[null,null,null,null,null,null,null,null,null,null,null,null,null,null,null,"2018-02-14",null,null,null,null,null,null,null,null,null,null,78.499999999999801,"SATISFACTORIO"]
[null,null,null,null,null,null,null,null,null,null,null,null,null,null,null,"2018-02-15",null,null,null,null,null,null,null,null,null,null,78.599999999999795,"SATISFACTORIO"]
[null,null,null,null,null,null,null,null,null,null,null,null,null,null,null,"2018-02-16",null,null,null,null,null,null,null,null,null,null,78.699999999999804,"SATISFACTORIO"]
[null,null,null,null,null,null,null,null,null,null,null,null,null,null,null,"2018-02-17",null,null,null,null,null,null,null,null,null,null,78.799999999999798,"SATISFACTORIO"]
[null,null,null,null,null,null,null,null,null,null,null,null,null,null,null,"2018-02-18",null,null,null,null,null,null,null,null,null,null,78.899999999999693,"SATISFACTORIO"]
[null,null,null,null,null,null,null,null,null,null,null,null,null,null,null,"2018-02-19",null,null,null,null,null,null,null,null,null,null,78.999999999999801,"SATISFACTORIO"]
[null,null,null,null,null,null,null,null,null,null,null,null,null,null,null,"2018-02-20",null,null,null,null,null,null,null,null,null,null,79.099999999999795,"SATISFACTORIO"]
[null,null,null,null,null,null,null,null,null,null,null,null,null,null,null,"2018-02-21",null,null,null,null,null,null,null,null,null,null,79.199999999999804,"SATISFACTORIO"]
[null,null,null,null,null,null,null,null,null,null,null,null,null,null,null,"2018-02-22",null,null,null,null,null,null,null,null,null,null,79.299999999999798,"SATISFACTORIO"]
[null,null,null,null,null,null,null,null,null,null,null,null,null,null,null,"2018-02-23",null,null,null,null,null,null,null,null,null,null,79.399999999999693,"SATISFACTORIO"]
[null,null,null,null,null,null,null,null,null,null,null,null,null,null,null,"2018-02-24",null,null,null,null,null,null,null,null,null,null,79.499999999999801,"SATISFACTORIO"]
[null,null,null,null,null,null,null,null,null,null,null,null,null,null,null,"2018-02-25",null,null,null,null,null,null,null,null,null,null,79.599999999999795,"SATISFACTORIO"]
[null,null,null,null,null,null,null,null,null,null,null,null,null,null,null,"2018-02-26",null,null,null,null,null,null,null,null,null,null,79.699999999999804,"SATISFACTORIO"]
[null,null,null,null,null,null,null,null,null,null,null,null,null,null,null,"2018-02-27",null,null,null,null,null,null,null,null,null,null,79.799999999999798,"SATISFACTORIO"]
[null,null,null,null,null,null,null,null,null,null,null,null,null,null,null,"2018-02-28",null,null,null,null,null,null,null,null,null,null,79.899999999999693,"SATISFACTORIO"]
[null,null,null,null,null,null,null,null,null,null,null,null,null,null,null,"2018-03-01",null,null,null,null,null,null,null,null,null,null,79.999999999999801,"SATISFACTORIO"]
[null,null,null,null,null,null,null,null,null,null,null,null,null,null,null,"2018-03-02",null,null,null,null,null,null,null,null,null,null,80.099999999999795,"SATISFACTORIO"]
[null,null,null,null,null,null,null,null,null,null,null,null,null,null,null,"2018-03-03",null,null,null,null,null,null,null,null,null,null,80.199999999999704,"SATISFACTORIO"]
[null,null,null,null,null,null,null,null,null,null,null,null,null,null,null,"2018-03-04",null,null,null,null,null,null,null,null,null,null,80.299999999999798,"SATISFACTORIO"]
[null,null,null,null,null,null,null,null,null,null,null,null,null,null,null,"2018-03-05",null,null,null,null,null,null,null,null,null,null,80.399999999999693,"SATISFACTORIO"]
[null,null,null,null,null,null,null,null,null,null,null,null,null,null,null,"2018-03-06",null,null,null,null,null,null,null,null,null,null,80.499999999999702,"SATISFACTORIO"]
[null,null,null,null,null,null,null,null,null,null,null,null,null,null,null,"2018-03-07",null,null,null,null,null,null,null,null,null,null,80.599999999999795,"SATISFACTORIO"]
[null,null,null,null,null,null,null,null,null,null,null,null,null,null,null,"2018-03-08",null,null,null,null,null,null,null,null,null,null,80.699999999999704,"SATISFACTORIO"]
[null,null,null,null,null,null,null,null,null,null,null,null,null,null,null,"2018-03-09",null,null,null,null,null,null,null,null,null,null,80.799999999999798,"SATISFACTORIO"]
[null,null,null,null,null,null,null,null,null,null,null,null,null,null,null,"2018-03-10",null,null,null,null,null,null,null,null,null,null,80.899999999999693,"SATISFACTORIO"]
[null,null,null,null,null,null,null,null,null,null,null,null,null,null,null,"2018-03-11",null,null,null,null,null,null,null,null,null,null,80.999999999999702,"SATISFACTORIO"]
[null,null,null,null,null,null,null,null,null,null,null,null,null,null,null,"2018-03-12",null,null,null,null,null,null,null,null,null,null,81.099999999999795,"SATISFACTORIO"]
[null,null,null,null,null,null,null,null,null,null,null,null,null,null,null,"2018-03-13",null,null,null,null,null,null,null,null,null,null,81.199999999999704,"SATISFACTORIO"]
[null,null,null,null,null,null,null,null,null,null,null,null,null,null,null,"2018-03-14",null,null,null,null,null,null,null,null,null,null,81.299999999999798,"SATISFACTORIO"]
[null,null,null,null,null,null,null,null,null,null,null,null,null,null,null,"2018-03-15",null,null,null,null,null,null,null,null,null,null,81.399999999999693,"SATISFACTORIO"]
[null,null,null,null,null,null,null,null,null,null,null,null,null,null,null,"2018-03-16",null,null,null,null,null,null,null,null,null,null,81.499999999999702,"SATISFACTORIO"]
[null,null,null,null,null,null,null,null,null,null,null,null,null,null,null,"2018-03-17",null,null,null,null,null,null,null,null,null,null,81.599999999999795,"SATISFACTORIO"]
[null,null,null,null,null,null,null,null,null,null,null,null,null,null,null,"2018-03-18",null,null,null,null,null,null,null,null,null,null,81.699999999999704,"SATISFACTORIO"]
[null,null,null,null,null,null,null,null,null,null,null,null,null,null,null,"2018-03-19",null,null,null,null,null,null,null,null,null,null,81.799999999999699,"SATISFACTORIO"]
[null,null,null,null,null,null,null,null,null,null,null,null,null,null,null,"2018-03-20",null,null,null,null,null,null,null,null,null,null,81.899999999999693,"SATISFACTORIO"]
[null,null,null,null,null,null,null,null,null,null,null,null,null,null,null,"2018-03-21",null,null,null,null,null,null,null,null,null,null,81.999999999999702,"SATISFACTORIO"]
[null,null,null,null,null,null,null,null,null,null,null,null,null,null,null,"2018-03-22",null,null,null,null,null,null,null,null,null,null,82.099999999999696,"SATISFACTORIO"]
[null,null,null,null,null,null,null,null,null,null,null,null,null,null,null,"2018-03-23",null,null,null,null,null,null,null,null,null,null,82.199999999999704,"SATISFACTORIO"]
[null,null,null,null,null,null,null,null,null,null,null,null,null,null,null,"2018-03-24",null,null,null,null,null,null,null,null,null,null,82.299999999999699,"SATISFACTORIO"]
[null,null,null,null,null,null,null,null,null,null,null,null,null,null,null,"2018-03-25",null,null,null,null,null,null,null,null,null,null,82.399999999999693,"SATISFACTORIO"]
[null,null,null,null,null,null,null,null,null,null,null,null,null,null,null,"2018-03-26",null,null,null,null,null,null,null,null,null,null,82.499999999999702,"SATISFACTORIO"]
[null,null,null,null,null,null,null,null,null,null,null,null,null,null,null,"2018-03-27",null,null,null,null,null,null,null,null,null,null,82.599999999999696,"SATISFACTORIO"]
[null,null,null,null,null,null,null,null,null,null,null,null,null,null,null,"2018-03-28",null,null,null,null,null,null,null,null,null,null,82.699999999999704,"SATISFACTORIO"]
[null,null,null,null,null,null,null,null,null,null,null,null,null,null,null,"2018-03-29",null,null,null,null,null,null,null,null,null,null,82.799999999999699,"SATISFACTORIO"]
[null,null,null,null,null,null,null,null,null,null,null,null,null,null,null,"2018-03-30",null,null,null,null,null,null,null,null,null,null,82.899999999999693,"SATISFACTORIO"]
[null,null,null,null,null,null,null,null,null,null,null,null,null,null,null,"2018-03-31",null,null,null,null,null,null,null,null,null,null,82.999999999999702,"SATISFACTORIO"]
[null,null,null,null,null,null,null,null,null,null,null,null,null,null,null,"2018-04-01",null,null,null,null,null,null,null,null,null,null,83.099999999999696,"SATISFACTORIO"]
[null,null,null,null,null,null,null,null,null,null,null,null,null,null,null,"2018-04-02",null,null,null,null,null,null,null,null,null,null,83.199999999999704,"SATISFACTORIO"]
[null,null,null,null,null,null,null,null,null,null,null,null,null,null,null,"2018-04-03",null,null,null,null,null,null,null,null,null,null,83.299999999999699,"SATISFACTORIO"]
[null,null,null,null,null,null,null,null,null,null,null,null,null,null,null,"2018-04-04",null,null,null,null,null,null,null,null,null,null,83.399999999999693,"SATISFACTORIO"]
[null,null,null,null,null,null,null,null,null,null,null,null,null,null,null,"2018-04-05",null,null,null,null,null,null,null,null,null,null,83.499999999999702,"SATISFACTORIO"]
[null,null,null,null,null,null,null,null,null,null,null,null,null,null,null,"2018-04-06",null,null,null,null,null,null,null,null,null,null,83.599999999999696,"SATISFACTORIO"]
[null,null,null,null,null,null,null,null,null,null,null,null,null,null,null,"2018-04-07",null,null,null,null,null,null,null,null,null,null,83.699999999999704,"SATISFACTORIO"]
[null,null,null,null,null,null,null,null,null,null,null,null,null,null,null,"2018-04-08",null,null,null,null,null,null,null,null,null,null,83.799999999999699,"SATISFACTORIO"]
[null,null,null,null,null,null,null,null,null,null,null,null,null,null,null,"2018-04-09",null,null,null,null,null,null,null,null,null,null,83.899999999999693,"SATISFACTORIO"]
[null,null,null,null,null,null,null,null,null,null,null,null,null,null,null,"2018-04-10",null,null,null,null,null,null,null,null,null,null,83.999999999999702,"SATISFACTORIO"]
[null,null,null,null,null,null,null,null,null,null,null,null,null,null,null,"2018-04-11",null,null,null,null,null,null,null,null,null,null,84.099999999999696,"SATISFACTORIO"]
[null,null,null,null,null,null,null,null,null,null,null,null,null,null,null,"2018-04-12",null,null,null,null,null,null,null,null,null,null,84.199999999999704,"SATISFACTORIO"]
[null,null,null,null,null,null,null,null,null,null,null,null,null,null,null,"2018-04-13",null,null,null,null,null,null,null,null,null,null,84.299999999999699,"SATISFACTORIO"]
[null,null,null,null,null,null,null,null,null,null,null,null,null,null,null,"2018-04-14",null,null,null,null,null,null,null,null,null,null,84.399999999999693,"SATISFACTORIO"]
[null,null,null,null,null,null,null,null,null,null,null,null,null,null,null,"2018-04-15",null,null,null,null,null,null,null,null,null,null,84.499999999999702,"SATISFACTORIO"]
[null,null,null,null,null,null,null,null,null,null,null,null,null,null,null,"2018-04-16",null,null,null,null,null,null,null,null,null,null,84.599999999999696,"SATISFACTORIO"]
[null,null,null,null,null,null,null,null,null,null,null,null,null,null,null,"2018-04-17",null,null,null,null,null,null,null,null,null,null,84.699999999999704,"SATISFACTORIO"]
[null,null,null,null,null,null,null,null,null,null,null,null,null,null,null,"2018-04-18",null,null,null,null,null,null,null,null,null,null,84.799999999999699,"SATISFACTORIO"]
[null,null,null,null,null,null,null,null,null,null,null,null,null,null,null,"2018-04-19",null,null,null,null,null,null,null,null,null,null,84.899999999999693,"SATISFACTORIO"]
[null,null,null,null,null,null,null,null,null,null,null,null,null,null,null,"2018-04-20",null,null,null,null,null,null,null,null,null,null,84.999999999999702,"SATISFACTORIO"]
[null,null,null,null,null,null,null,null,null,null,null,null,null,null,null,"2018-04-21",null,null,null,null,null,null,null,null,null,null,85.099999999999696,"SATISFACTORIO"]
[null,null,null,null,null,null,null,null,null,null,null,null,null,null,null,"2018-04-22",null,null,null,null,null,null,null,null,null,null,85.199999999999704,"SATISFACTORIO"]
[null,null,null,null,null,null,null,null,null,null,null,null,null,null,null,"2018-04-23",null,null,null,null,null,null,null,null,null,null,85.299999999999699,"SATISFACTORIO"]
[null,null,null,null,null,null,null,null,null,null,null,null,null,null,null,"2018-04-24",null,null,null,null,null,null,null,null,null,null,85.399999999999693,"SATISFACTORIO"]
[null,null,null,null,null,null,null,null,null,null,null,null,null,null,null,"2018-04-25",null,null,null,null,null,null,null,null,null,null,85.499999999999702,"SATISFACTORIO"]
[null,null,null,null,null,null,null,null,null,null,null,null,null,null,null,"2018-04-26",null,null,null,null,null,null,null,null,null,null,85.599999999999696,"SATISFACTORIO"]
[null,null,null,null,null,null,null,null,null,null,null,null,null,null,null,"2018-04-27",null,null,null,null,null,null,null,null,null,null,85.699999999999704,"SATISFACTORIO"]
[null,null,null,null,null,null,null,null,null,null,null,null,null,null,null,"2018-04-28",null,null,null,null,null,null,null,null,null,null,85.799999999999699,"SATISFACTORIO"]
[null,null,null,null,null,null,null,null,null,null,null,null,null,null,null,"2018-04-29",null,null,null,null,null,null,null,null,null,null,85.899999999999693,"SATISFACTORIO"]
[null,null,null,null,null,null,null,null,null,null,null,null,null,null,null,"2018-04-30",null,null,null,null,null,null,null,null,null,null,85.999999999999702,"SATISFACTORIO"]
[null,null,null,null,null,null,null,null,null,null,null,null,null,null,null,"2018-05-01",null,null,null,null,null,null,null,null,null,null,86.099999999999696,"SATISFACTORIO"]
[null,null,null,null,null,null,null,null,null,null,null,null,null,null,null,"2018-05-02",null,null,null,null,null,null,null,null,null,null,86.199999999999704,"SATISFACTORIO"]
[null,null,null,null,null,null,null,null,null,null,null,null,null,null,null,"2018-05-03",null,null,null,null,null,null,null,null,null,null,86.299999999999699,"SATISFACTORIO"]
[null,null,null,null,null,null,null,null,null,null,null,null,null,null,null,"2018-05-04",null,null,null,null,null,null,null,null,null,null,86.399999999999693,"SATISFACTORIO"]
[null,null,null,null,null,null,null,null,null,null,null,null,null,null,null,"2018-05-05",null,null,null,null,null,null,null,null,null,null,86.499999999999702,"SATISFACTORIO"]
[null,null,null,null,null,null,null,null,null,null,null,null,null,null,null,"2018-05-06",null,null,null,null,null,null,null,null,null,null,86.599999999999696,"SATISFACTORIO"]
[null,null,null,null,null,null,null,null,null,null,null,null,null,null,null,"2018-05-07",null,null,null,null,null,null,null,null,null,null,86.699999999999704,"SATISFACTORIO"]
[null,null,null,null,null,null,null,null,null,null,null,null,null,null,null,"2018-05-08",null,null,null,null,null,null,null,null,null,null,86.799999999999699,"SATISFACTORIO"]
[null,null,null,null,null,null,null,null,null,null,null,null,null,null,null,"2018-05-09",null,null,null,null,null,null,null,null,null,null,86.899999999999693,"SATISFACTORIO"]
[null,null,null,null,null,null,null,null,null,null,null,null,null,null,null,"2018-05-10",null,null,null,null,null,null,null,null,null,null,86.999999999999702,"SATISFACTORIO"]
[null,null,null,null,null,null,null,null,null,null,null,null,null,null,null,"2018-05-11",null,null,null,null,null,null,null,null,null,null,87.099999999999696,"SATISFACTORIO"]
[null,null,null,null,null,null,null,null,null,null,null,null,null,null,null,"2018-05-12",null,null,null,null,null,null,null,null,null,null,87.199999999999704,"SATISFACTORIO"]
[null,null,null,null,null,null,null,null,null,null,null,null,null,null,null,"2018-05-13",null,null,null,null,null,null,null,null,null,null,87.299999999999699,"SATISFACTORIO"]
[null,null,null,null,null,null,null,null,null,null,null,null,null,null,null,"2018-05-14",null,null,null,null,null,null,null,null,null,null,87.399999999999693,"SATISFACTORIO"]
[null,null,null,null,null,null,null,null,null,null,null,null,null,null,null,"2018-05-15",null,null,null,null,null,null,null,null,null,null,87.499999999999702,"SATISFACTORIO"]
[null,null,null,null,null,null,null,null,null,null,null,null,null,null,null,"2018-05-16",null,null,null,null,null,null,null,null,null,null,87.599999999999696,"SATISFACTORIO"]
[null,null,null,null,null,null,null,null,null,null,null,null,null,null,null,"2018-05-17",null,null,null,null,null,null,null,null,null,null,87.699999999999704,"SATISFACTORIO"]
[null,null,null,null,null,null,null,null,null,null,null,null,null,null,null,"2018-05-18",null,null,null,null,null,null,null,null,null,null,87.799999999999699,"SATISFACTORIO"]
[null,null,null,null,null,null,null,null,null,null,null,null,null,null,null,"2018-05-19",null,null,null,null,null,null,null,null,null,null,87.899999999999693,"SATISFACTORIO"]
[null,null,null,null,null,null,null,null,null,null,null,null,null,null,null,"2018-05-20",null,null,null,null,null,null,null,null,null,null,87.999999999999702,"SATISFACTORIO"]
[null,null,null,null,null,null,null,null,null,null,null,null,null,null,null,"2018-05-21",null,null,null,null,null,null,null,null,null,null,88.099999999999696,"SATISFACTORIO"]
[null,null,null,null,null,null,null,null,null,null,null,null,null,null,null,"2018-05-22",null,null,null,null,null,null,null,null,null,null,88.199999999999704,"SATISFACTORIO"]
[null,null,null,null,null,null,null,null,null,null,null,null,null,null,null,"2018-05-23",null,null,null,null,null,null,null,null,null,null,88.299999999999699,"SATISFACTORIO"]
[null,null,null,null,null,null,null,null,null,null,null,null,null,null,null,"2018-05-24",null,null,null,null,null,null,null,null,null,null,88.399999999999693,"SATISFACTORIO"]
[null,null,null,null,null,null,null,null,null,null,null,null,null,null,null,"2018-05-25",null,null,null,null,null,null,null,null,null,null,88.499999999999702,"SATISFACTORIO"]
[null,null,null,null,null,null,null,null,null,null,null,null,null,null,null,"2018-05-26",null,null,null,null,null,null,null,null,null,null,88.599999999999696,"SATISFACTORIO"]
[null,null,null,null,null,null,null,null,null,null,null,null,null,null,null,"2018-05-27",null,null,null,null,null,null,null,null,null,null,88.699999999999704,"SATISFACTORIO"]
[null,null,null,null,null,null,null,null,null,null,null,null,null,null,null,"2018-05-28",null,null,null,null,null,null,null,null,null,null,88.799999999999699,"SATISFACTORIO"]
[null,null,null,null,null,null,null,null,null,null,null,null,null,null,null,"2018-05-29",null,null,null,null,null,null,null,null,null,null,88.899999999999693,"SATISFACTORIO"]
[null,null,null,null,null,null,null,null,null,null,null,null,null,null,null,"2018-05-30",null,null,null,null,null,null,null,null,null,null,88.999999999999702,"SATISFACTORIO"]
[null,null,null,null,null,null,null,null,null,null,null,null,null,null,null,"2018-05-31",null,null,null,null,null,null,null,null,null,null,89.099999999999696,"SATISFACTORIO"]
[null,null,null,null,null,null,null,null,null,null,null,null,null,null,null,"2018-06-01",null,null,null,null,null,null,null,null,null,null,89.199999999999704,"SATISFACTORIO"]
[null,null,null,null,null,null,null,null,null,null,null,null,null,null,null,"2018-06-02",null,null,null,null,null,null,null,null,null,null,89.299999999999699,"SATISFACTORIO"]
[null,null,null,null,null,null,null,null,null,null,null,null,null,null,null,"2018-06-03",null,null,null,null,null,null,null,null,null,null,89.399999999999693,"SATISFACTORIO"]
[null,null,null,null,null,null,null,null,null,null,null,null,null,null,null,"2018-06-04",null,null,null,null,null,null,null,null,null,null,89.499999999999702,"SATISFACTORIO"]
[null,null,null,null,null,null,null,null,null,null,null,null,null,null,null,"2018-06-05",null,null,null,null,null,null,null,null,null,null,89.599999999999696,"SATISFACTORIO"]
[null,null,null,null,null,null,null,null,null,null,null,null,null,null,null,"2018-06-06",null,null,null,null,null,null,null,null,null,null,89.699999999999704,"SATISFACTORIO"]
[null,null,null,null,null,null,null,null,null,null,null,null,null,null,null,"2018-06-07",null,null,null,null,null,null,null,null,null,null,89.799999999999699,"SATISFACTORIO"]
[null,null,null,null,null,null,null,null,null,null,null,null,null,null,null,"2018-06-08",null,null,null,null,null,null,null,null,null,null,89.899999999999693,"SATISFACTORIO"]
[null,null,null,null,null,null,null,null,null,null,null,null,null,null,null,"2018-06-09",null,null,null,null,null,null,null,null,null,null,89.999999999999702,"SATISFACTORIO"]
[null,null,null,null,null,null,null,null,null,null,null,null,null,null,null,"2018-06-10",null,null,null,null,null,null,null,null,null,null,90.099999999999696,"SATISFACTORIO"]
[null,null,null,null,null,null,null,null,null,null,null,null,null,null,null,"2018-06-11",null,null,null,null,null,null,null,null,null,null,90.199999999999704,"SATISFACTORIO"]
[null,null,null,null,null,null,null,null,null,null,null,null,null,null,null,"2018-06-12",null,null,null,null,null,null,null,null,null,null,90.299999999999699,"SATISFACTORIO"]
[null,null,null,null,null,null,null,null,null,null,null,null,null,null,null,"2018-06-13",null,null,null,null,null,null,null,null,null,null,90.399999999999693,"SATISFACTORIO"]
[null,null,null,null,null,null,null,null,null,null,null,null,null,null,null,"2018-06-14",null,null,null,null,null,null,null,null,null,null,90.499999999999702,"SATISFACTORIO"]
[null,null,null,null,null,null,null,null,null,null,null,null,null,null,null,"2018-06-15",null,null,null,null,null,null,null,null,null,null,90.599999999999696,"SATISFACTORIO"]
[null,null,null,null,null,null,null,null,null,null,null,null,null,null,null,"2018-06-16",null,null,null,null,null,null,null,null,null,null,90.699999999999704,"SATISFACTORIO"]
[null,null,null,null,null,null,null,null,null,null,null,null,null,null,null,"2018-06-17",null,null,null,null,null,null,null,null,null,null,90.799999999999699,"SATISFACTORIO"]
[null,null,null,null,null,null,null,null,null,null,null,null,null,null,null,"2018-06-18",null,null,null,null,null,null,null,null,null,null,90.899999999999693,"SATISFACTORIO"]
[null,null,null,null,null,null,null,null,null,null,null,null,null,null,null,"2018-06-19",null,null,null,null,null,null,null,null,null,null,90.999999999999702,"SATISFACTORIO"]
[null,null,null,null,null,null,null,null,null,null,null,null,null,null,null,"2018-06-20",null,null,null,null,null,null,null,null,null,null,91.099999999999696,"SATISFACTORIO"]
[null,null,null,null,null,null,null,null,null,null,null,null,null,null,null,"2018-06-21",null,null,null,null,null,null,null,null,null,null,91.199999999999704,"SATISFACTORIO"]
[null,null,null,null,null,null,null,null,null,null,null,null,null,null,null,"2018-06-22",null,null,null,null,null,null,null,null,null,null,91.299999999999699,"SATISFACTORIO"]
[null,null,null,null,null,null,null,null,null,null,null,null,null,null,null,"2018-06-23",null,null,null,null,null,null,null,null,null,null,91.399999999999693,"SATISFACTORIO"]
[null,null,null,null,null,null,null,null,null,null,null,null,null,null,null,"2018-06-24",null,null,null,null,null,null,null,null,null,null,91.499999999999702,"SATISFACTORIO"]
[null,null,null,null,null,null,null,null,null,null,null,null,null,null,null,"2018-06-25",null,null,null,null,null,null,null,null,null,null,91.599999999999696,"SATISFACTORIO"]
[null,null,null,null,null,null,null,null,null,null,null,null,null,null,null,"2018-06-26",null,null,null,null,null,null,null,null,null,null,91.699999999999704,"SATISFACTORIO"]
[null,null,null,null,null,null,null,null,null,null,null,null,null,null,null,"2018-06-27",null,null,null,null,null,null,null,null,null,null,91.799999999999699,"SATISFACTORIO"]
[null,null,null,null,null,null,null,null,null,null,null,null,null,null,null,"2018-06-28",null,null,null,null,null,null,null,null,null,null,91.899999999999693,"SATISFACTORIO"]
[null,null,null,null,null,null,null,null,null,null,null,null,null,null,null,"2018-06-29",null,null,null,null,null,null,null,null,null,null,91.999999999999702,"SATISFACTORIO"]
[null,null,null,null,null,null,null,null,null,null,null,null,null,null,null,"2018-06-30",null,null,null,null,null,null,null,null,null,null,92.099999999999696,"SATISFACTORIO"]
[null,null,null,null,null,null,null,null,null,null,null,null,null,null,null,"2018-07-01",null,null,null,null,null,null,null,null,null,null,92.199999999999704,"SATISFACTORIO"]
[null,null,null,null,null,null,null,null,null,null,null,null,null,null,null,"2018-07-02",null,null,null,null,null,null,null,null,null,null,92.299999999999699,"SATISFACTORIO"]
[null,null,null,null,null,null,null,null,null,null,null,null,null,null,null,"2018-07-03",null,null,null,null,null,null,null,null,null,null,92.399999999999693,"SATISFACTORIO"]
[null,null,null,null,null,null,null,null,null,null,null,null,null,null,null,"2018-07-04",null,null,null,null,null,null,null,null,null,null,92.499999999999702,"SATISFACTORIO"]
[null,null,null,null,null,null,null,null,null,null,null,null,null,null,null,"2018-07-05",null,null,null,null,null,null,null,null,null,null,92.599999999999696,"SATISFACTORIO"]
[null,null,null,null,null,null,null,null,null,null,null,null,null,null,null,"2018-07-06",null,null,null,null,null,null,null,null,null,null,92.699999999999704,"SATISFACTORIO"]
[null,null,null,null,null,null,null,null,null,null,null,null,null,null,null,"2018-07-07",null,null,null,null,null,null,null,null,null,null,92.799999999999699,"SATISFACTORIO"]
[null,null,null,null,null,null,null,null,null,null,null,null,null,null,null,"2018-07-08",null,null,null,null,null,null,null,null,null,null,92.899999999999693,"SATISFACTORIO"]
[null,null,null,null,null,null,null,null,null,null,null,null,null,null,null,"2018-07-09",null,null,null,null,null,null,null,null,null,null,92.999999999999702,"SATISFACTORIO"]
[null,null,null,null,null,null,null,null,null,null,null,null,null,null,null,"2018-07-10",null,null,null,null,null,null,null,null,null,null,93.099999999999696,"SATISFACTORIO"]
[null,null,null,null,null,null,null,null,null,null,null,null,null,null,null,"2018-07-11",null,null,null,null,null,null,null,null,null,null,93.199999999999704,"SATISFACTORIO"]
[null,null,null,null,null,null,null,null,null,null,null,null,null,null,null,"2018-07-12",null,null,null,null,null,null,null,null,null,null,93.299999999999699,"SATISFACTORIO"]
[null,null,null,null,null,null,null,null,null,null,null,null,null,null,null,"2018-07-13",null,null,null,null,null,null,null,null,null,null,93.399999999999693,"SATISFACTORIO"]
[null,null,null,null,null,null,null,null,null,null,null,null,null,null,null,"2018-07-14",null,null,null,null,null,null,null,null,null,null,93.499999999999702,"SATISFACTORIO"]
[null,null,null,null,null,null,null,null,null,null,null,null,null,null,null,"2018-07-15",null,null,null,null,null,null,null,null,null,null,93.599999999999696,"SATISFACTORIO"]
[null,null,null,null,null,null,null,null,null,null,null,null,null,null,null,"2018-07-16",null,null,null,null,null,null,null,null,null,null,93.699999999999704,"SATISFACTORIO"]
[null,null,null,null,null,null,null,null,null,null,null,null,null,null,null,"2018-07-17",null,null,null,null,null,null,null,null,null,null,93.799999999999699,"SATISFACTORIO"]
[null,null,null,null,null,null,null,null,null,null,null,null,null,null,null,"2018-07-18",null,null,null,null,null,null,null,null,null,null,93.899999999999693,"SATISFACTORIO"]
[null,null,null,null,null,null,null,null,null,null,null,null,null,null,null,"2018-07-19",null,null,null,null,null,null,null,null,null,null,93.999999999999702,"SATISFACTORIO"]
[null,null,null,null,null,null,null,null,null,null,null,null,null,null,null,"2018-07-20",null,null,null,null,null,null,null,null,null,null,94.099999999999696,"SATISFACTORIO"]
[null,null,null,null,null,null,null,null,null,null,null,null,null,null,null,"2018-07-21",null,null,null,null,null,null,null,null,null,null,94.199999999999704,"SATISFACTORIO"]
[null,null,null,null,null,null,null,null,null,null,null,null,null,null,null,"2018-07-22",null,null,null,null,null,null,null,null,null,null,94.299999999999699,"SATISFACTORIO"]
[null,null,null,null,null,null,null,null,null,null,null,null,null,null,null,"2018-07-23",null,null,null,null,null,null,null,null,null,null,94.399999999999693,"SATISFACTORIO"]
[null,null,null,null,null,null,null,null,null,null,null,null,null,null,null,"2018-07-24",null,null,null,null,null,null,null,null,null,null,94.499999999999702,"SATISFACTORIO"]
[null,null,null,null,null,null,null,null,null,null,null,null,null,null,null,"2018-07-25",null,null,null,null,null,null,null,null,null,null,94.599999999999696,"SATISFACTORIO"]
[null,null,null,null,null,null,null,null,null,null,null,null,null,null,null,"2018-07-26",null,null,null,null,null,null,null,null,null,null,94.699999999999704,"SATISFACTORIO"]
[null,null,null,null,null,null,null,null,null,null,null,null,null,null,null,"2018-07-27",null,null,null,null,null,null,null,null,null,null,94.799999999999699,"SATISFACTORIO"]
[null,null,null,null,null,null,null,null,null,null,null,null,null,null,null,"2018-07-28",null,null,null,null,null,null,null,null,null,null,94.899999999999693,"SATISFACTORIO"]
[null,null,null,null,null,null,null,null,null,null,null,null,null,null,null,"2018-07-29",null,null,null,null,null,null,null,null,null,null,94.999999999999702,"SOBRESALIENTE"]
[null,null,null,null,null,null,null,null,null,null,null,null,null,null,null,"2018-07-30",null,null,null,null,null,null,null,null,null,null,95.099999999999696,"SOBRESALIENTE"]
[null,null,null,null,null,null,null,null,null,null,null,null,null,null,null,"2018-07-31",null,null,null,null,null,null,null,null,null,null,95.199999999999704,"SOBRESALIENTE"]
[null,null,null,null,null,null,null,null,null,null,null,null,null,null,null,"2018-08-01",null,null,null,null,null,null,null,null,null,null,95.299999999999699,"SOBRESALIENTE"]
[null,null,null,null,null,null,null,null,null,null,null,null,null,null,null,"2018-08-02",null,null,null,null,null,null,null,null,null,null,95.399999999999693,"SOBRESALIENTE"]
[null,null,null,null,null,null,null,null,null,null,null,null,null,null,null,"2018-08-03",null,null,null,null,null,null,null,null,null,null,95.499999999999702,"SOBRESALIENTE"]
[null,null,null,null,null,null,null,null,null,null,null,null,null,null,null,"2018-08-04",null,null,null,null,null,null,null,null,null,null,95.599999999999696,"SOBRESALIENTE"]
[null,null,null,null,null,null,null,null,null,null,null,null,null,null,null,"2018-08-05",null,null,null,null,null,null,null,null,null,null,95.699999999999704,"SOBRESALIENTE"]
[null,null,null,null,null,null,null,null,null,null,null,null,null,null,null,"2018-08-06",null,null,null,null,null,null,null,null,null,null,95.799999999999699,"SOBRESALIENTE"]
[null,null,null,null,null,null,null,null,null,null,null,null,null,null,null,"2018-08-07",null,null,null,null,null,null,null,null,null,null,95.899999999999693,"SOBRESALIENTE"]
[null,null,null,null,null,null,null,null,null,null,null,null,null,null,null,"2018-08-08",null,null,null,null,null,null,null,null,null,null,95.999999999999702,"SOBRESALIENTE"]
[null,null,null,null,null,null,null,null,null,null,null,null,null,null,null,"2018-08-09",null,null,null,null,null,null,null,null,null,null,96.099999999999696,"SOBRESALIENTE"]
[null,null,null,null,null,null,null,null,null,null,null,null,null,null,null,"2018-08-10",null,null,null,null,null,null,null,null,null,null,96.199999999999704,"SOBRESALIENTE"]
[null,null,null,null,null,null,null,null,null,null,null,null,null,null,null,"2018-08-11",null,null,null,null,null,null,null,null,null,null,96.299999999999699,"SOBRESALIENTE"]
[null,null,null,null,null,null,null,null,null,null,null,null,null,null,null,"2018-08-12",null,null,null,null,null,null,null,null,null,null,96.399999999999693,"SOBRESALIENTE"]
[null,null,null,null,null,null,null,null,null,null,null,null,null,null,null,"2018-08-13",null,null,null,null,null,null,null,null,null,null,96.499999999999702,"SOBRESALIENTE"]
[null,null,null,null,null,null,null,null,null,null,null,null,null,null,null,"2018-08-14",null,null,null,null,null,null,null,null,null,null,96.599999999999696,"SOBRESALIENTE"]
[null,null,null,null,null,null,null,null,null,null,null,null,null,null,null,"2018-08-15",null,null,null,null,null,null,null,null,null,null,96.699999999999704,"SOBRESALIENTE"]
[null,null,null,null,null,null,null,null,null,null,null,null,null,null,null,"2018-08-16",null,null,null,null,null,null,null,null,null,null,96.799999999999699,"SOBRESALIENTE"]
[null,null,null,null,null,null,null,null,null,null,null,null,null,null,null,"2018-08-17",null,null,null,null,null,null,null,null,null,null,96.899999999999693,"SOBRESALIENTE"]
[null,null,null,null,null,null,null,null,null,null,null,null,null,null,null,"2018-08-18",null,null,null,null,null,null,null,null,null,null,96.999999999999702,"SOBRESALIENTE"]
[null,null,null,null,null,null,null,null,null,null,null,null,null,null,null,"2018-08-19",null,null,null,null,null,null,null,null,null,null,97.099999999999696,"SOBRESALIENTE"]
[null,null,null,null,null,null,null,null,null,null,null,null,null,null,null,"2018-08-20",null,null,null,null,null,null,null,null,null,null,97.199999999999704,"SOBRESALIENTE"]
[null,null,null,null,null,null,null,null,null,null,null,null,null,null,null,"2018-08-21",null,null,null,null,null,null,null,null,null,null,97.299999999999699,"SOBRESALIENTE"]
[null,null,null,null,null,null,null,null,null,null,null,null,null,null,null,"2018-08-22",null,null,null,null,null,null,null,null,null,null,97.399999999999693,"SOBRESALIENTE"]
[null,null,null,null,null,null,null,null,null,null,null,null,null,null,null,"2018-08-23",null,null,null,null,null,null,null,null,null,null,97.499999999999702,"SOBRESALIENTE"]
[null,null,null,null,null,null,null,null,null,null,null,null,null,null,null,"2018-08-24",null,null,null,null,null,null,null,null,null,null,97.599999999999696,"SOBRESALIENTE"]
[null,null,null,null,null,null,null,null,null,null,null,null,null,null,null,"2018-08-25",null,null,null,null,null,null,null,null,null,null,97.699999999999704,"SOBRESALIENTE"]
[null,null,null,null,null,null,null,null,null,null,null,null,null,null,null,"2018-08-26",null,null,null,null,null,null,null,null,null,null,97.799999999999699,"SOBRESALIENTE"]
[null,null,null,null,null,null,null,null,null,null,null,null,null,null,null,"2018-08-27",null,null,null,null,null,null,null,null,null,null,97.899999999999693,"SOBRESALIENTE"]
[null,null,null,null,null,null,null,null,null,null,null,null,null,null,null,"2018-08-28",null,null,null,null,null,null,null,null,null,null,97.999999999999702,"SOBRESALIENTE"]
[null,null,null,null,null,null,null,null,null,null,null,null,null,null,null,"2018-08-29",null,null,null,null,null,null,null,null,null,null,98.099999999999696,"SOBRESALIENTE"]
[null,null,null,null,null,null,null,null,null,null,null,null,null,null,null,"2018-08-30",null,null,null,null,null,null,null,null,null,null,98.199999999999704,"SOBRESALIENTE"]
[null,null,null,null,null,null,null,null,null,null,null,null,null,null,null,"2018-08-31",null,null,null,null,null,null,null,null,null,null,98.299999999999699,"SOBRESALIENTE"]
[null,null,null,null,null,null,null,null,null,null,null,null,null,null,null,"2018-09-01",null,null,null,null,null,null,null,null,null,null,98.399999999999693,"SOBRESALIENTE"]
[null,null,null,null,null,null,null,null,null,null,null,null,null,null,null,"2018-09-02",null,null,null,null,null,null,null,null,null,null,98.499999999999702,"SOBRESALIENTE"]
[null,null,null,null,null,null,null,null,null,null,null,null,null,null,null,"2018-09-03",null,null,null,null,null,null,null,null,null,null,98.599999999999696,"SOBRESALIENTE"]
[null,null,null,null,null,null,null,null,null,null,null,null,null,null,null,"2018-09-04",null,null,null,null,null,null,null,null,null,null,98.699999999999704,"SOBRESALIENTE"]
[null,null,null,null,null,null,null,null,null,null,null,null,null,null,null,"2018-09-05",null,null,null,null,null,null,null,null,null,null,98.799999999999699,"SOBRESALIENTE"]
[null,null,null,null,null,null,null,null,null,null,null,null,null,null,null,"2018-09-06",null,null,null,null,null,null,null,null,null,null,98.899999999999693,"SOBRESALIENTE"]
[null,null,null,null,null,null,null,null,null,null,null,null,null,null,null,"2018-09-07",null,null,null,null,null,null,null,null,null,null,98.999999999999702,"SOBRESALIENTE"]
[null,null,null,null,null,null,null,null,null,null,null,null,null,null,null,"2018-09-08",null,null,null,null,null,null,null,null,null,null,99.099999999999696,"SOBRESALIENTE"]
[null,null,null,null,null,null,null,null,null,null,null,null,null,null,null,"2018-09-09",null,null,null,null,null,null,null,null,null,null,99.199999999999704,"SOBRESALIENTE"]
[null,null,null,null,null,null,null,null,null,null,null,null,null,null,null,"2018-09-10",null,null,null,null,null,null,null,null,null,null,99.299999999999699,"SOBRESALIENTE"]
[null,null,null,null,null,null,null,null,null,null,null,null,null,null,null,"2018-09-11",null,null,null,null,null,null,null,null,null,null,99.399999999999693,"SOBRESALIENTE"]
[null,null,null,null,null,null,null,null,null,null,null,null,null,null,null,"2018-09-12",null,null,null,null,null,null,null,null,null,null,99.499999999999702,"SOBRESALIENTE"]
[null,null,null,null,null,null,null,null,null,null,null,null,null,null,null,"2018-09-13",null,null,null,null,null,null,null,null,null,null,99.599999999999696,"SOBRESALIENTE"]
[null,null,null,null,null,null,null,null,null,null,null,null,null,null,null,"2018-09-14",null,null,null,null,null,null,null,null,null,null,99.699999999999704,"SOBRESALIENTE"]
[null,null,null,null,null,null,null,null,null,null,null,null,null,null,null,"2018-09-15",null,null,null,null,null,null,null,null,null,null,99.799999999999699,"SOBRESALIENTE"]
[null,null,null,null,null,null,null,null,null,null,null,null,null,null,null,"2018-09-16",null,null,null,null,null,null,null,null,null,null,99.899999999999693,"SOBRESALIENTE"]
[null,null,null,null,null,null,null,null,null,null,null,null,null,null,null,"2018-09-17",null,null,null,null,null,null,null,null,null,null,99.999999999999702,"SOBRESALIENTE"]
[null,null,null,null,null,null,null,null,null,null,null,null,null,null,null,"2018-09-18"]
[null,null,null,null,null,null,null,null,null,null,null,null,null,null,null,"2018-09-19"]
[null,null,null,null,null,null,null,null,null,null,null,null,null,null,null,"2018-09-20"]
[null,null,null,null,null,null,null,null,null,null,null,null,null,null,null,"2018-09-21"]
[null,null,null,null,null,null,null,null,null,null,null,null,null,null,null,"2018-09-22"]
[null,null,null,null,null,null,null,null,null,null,null,null,null,null,null,"2018-09-23"]
[null,null,null,null,null,null,null,null,null,null,null,null,null,null,null,"2018-09-24"]
[null,null,null,null,null,null,null,null,null,null,null,null,null,null,null,"2018-09-25"]
[null,null,null,null,null,null,null,null,null,null,null,null,null,null,null,"2018-09-26"]
[null,null,null,null,null,null,null,null,null,null,null,null,null,null,null,"2018-09-27"]
[null,null,null,null,null,null,null,null,null,null,null,null,null,null,null,"2018-09-28"]
[null,null,null,null,null,null,null,null,null,null,null,null,null,null,null,"2018-09-29"]
[null,null,null,null,null,null,null,null,null,null,null,null,null,null,null,"2018-09-30"]
[null,null,null,null,null,null,null,null,null,null,null,null,null,null,null,"2018-10-01"]
[null,null,null,null,null,null,null,null,null,null,null,null,null,null,null,"2018-10-02"]
[null,null,null,null,null,null,null,null,null,null,null,null,null,null,null,"2018-10-03"]
[null,null,null,null,null,null,null,null,null,null,null,null,null,null,null,"2018-10-04"]
[null,null,null,null,null,null,null,null,null,null,null,null,null,null,null,"2018-10-05"]
[null,null,null,null,null,null,null,null,null,null,null,null,null,null,null,"2018-10-06"]
[null,null,null,null,null,null,null,null,null,null,null,null,null,null,null,"2018-10-07"]
[null,null,null,null,null,null,null,null,null,null,null,null,null,null,null,"2018-10-08"]
[null,null,null,null,null,null,null,null,null,null,null,null,null,null,null,"2018-10-09"]
[null,null,null,null,null,null,null,null,null,null,null,null,null,null,null,"2018-10-10"]
[null,null,null,null,null,null,null,null,null,null,null,null,null,null,null,"2018-10-11"]
[null,null,null,null,null,null,null,null,null,null,null,null,null,null,null,"2018-10-12"]
[null,null,null,null,null,null,null,null,null,null,null,null,null,null,null,"2018-10-13"]
[null,null,null,null,null,null,null,null,null,null,null,null,null,null,null,"2018-10-14"]
[null,null,null,null,null,null,null,null,null,null,null,null,null,null,null,"2018-10-15"]
[null,null,null,null,null,null,null,null,null,null,null,null,null,null,null,"2018-10-16"]
[null,null,null,null,null,null,null,null,null,null,null,null,null,null,null,"2018-10-17"]
[null,null,null,null,null,null,null,null,null,null,null,null,null,null,null,"2018-10-18"]
[null,null,null,null,null,null,null,null,null,null,null,null,null,null,null,"2018-10-19"]
[null,null,null,null,null,null,null,null,null,null,null,null,null,null,null,"2018-10-20"]
[null,null,null,null,null,null,null,null,null,null,null,null,null,null,null,"2018-10-21"]
[null,null,null,null,null,null,null,null,null,null,null,null,null,null,null,"2018-10-22"]
[null,null,null,null,null,null,null,null,null,null,null,null,null,null,null,"2018-10-23"]
[null,null,null,null,null,null,null,null,null,null,null,null,null,null,null,"2018-10-24"]
[null,null,null,null,null,null,null,null,null,null,null,null,null,null,null,"2018-10-25"]
[null,null,null,null,null,null,null,null,null,null,null,null,null,null,null,"2018-10-26"]
[null,null,null,null,null,null,null,null,null,null,null,null,null,null,null,"2018-10-27"]
[null,null,null,null,null,null,null,null,null,null,null,null,null,null,null,"2018-10-28"]
[null,null,null,null,null,null,null,null,null,null,null,null,null,null,null,"2018-10-29"]
[null,null,null,null,null,null,null,null,null,null,null,null,null,null,null,"2018-10-30"]
[null,null,null,null,null,null,null,null,null,null,null,null,null,null,null,"2018-10-31"]
[null,null,null,null,null,null,null,null,null,null,null,null,null,null,null,"2018-11-01"]
[null,null,null,null,null,null,null,null,null,null,null,null,null,null,null,"2018-11-02"]
[null,null,null,null,null,null,null,null,null,null,null,null,null,null,null,"2018-11-03"]
[null,null,null,null,null,null,null,null,null,null,null,null,null,null,null,"2018-11-04"]
[null,null,null,null,null,null,null,null,null,null,null,null,null,null,null,"2018-11-05"]
[null,null,null,null,null,null,null,null,null,null,null,null,null,null,null,"2018-11-06"]
[null,null,null,null,null,null,null,null,null,null,null,null,null,null,null,"2018-11-07"]
[null,null,null,null,null,null,null,null,null,null,null,null,null,null,null,"2018-11-08"]
[null,null,null,null,null,null,null,null,null,null,null,null,null,null,null,"2018-11-09"]
[null,null,null,null,null,null,null,null,null,null,null,null,null,null,null,"2018-11-10"]
[null,null,null,null,null,null,null,null,null,null,null,null,null,null,null,"2018-11-11"]
[null,null,null,null,null,null,null,null,null,null,null,null,null,null,null,"2018-11-12"]
[null,null,null,null,null,null,null,null,null,null,null,null,null,null,null,"2018-11-13"]
[null,null,null,null,null,null,null,null,null,null,null,null,null,null,null,"2018-11-14"]
[null,null,null,null,null,null,null,null,null,null,null,null,null,null,null,"2018-11-15"]
[null,null,null,null,null,null,null,null,null,null,null,null,null,null,null,"2018-11-16"]
[null,null,null,null,null,null,null,null,null,null,null,null,null,null,null,"2018-11-17"]
[null,null,null,null,null,null,null,null,null,null,null,null,null,null,null,"2018-11-18"]
[null,null,null,null,null,null,null,null,null,null,null,null,null,null,null,"2018-11-19"]
[null,null,null,null,null,null,null,null,null,null,null,null,null,null,null,"2018-11-20"]
[null,null,null,null,null,null,null,null,null,null,null,null,null,null,null,"2018-11-21"]
[null,null,null,null,null,null,null,null,null,null,null,null,null,null,null,"2018-11-22"]
[null,null,null,null,null,null,null,null,null,null,null,null,null,null,null,"2018-11-23"]
[null,null,null,null,null,null,null,null,null,null,null,null,null,null,null,"2018-11-24"]
[null,null,null,null,null,null,null,null,null,null,null,null,null,null,null,"2018-11-25"]
[null,null,null,null,null,null,null,null,null,null,null,null,null,null,null,"2018-11-26"]
[null,null,null,null,null,null,null,null,null,null,null,null,null,null,null,"2018-11-27"]
[null,null,null,null,null,null,null,null,null,null,null,null,null,null,null,"2018-11-28"]
[null,null,null,null,null,null,null,null,null,null,null,null,null,null,null,"2018-11-29"]
[null,null,null,null,null,null,null,null,null,null,null,null,null,null,null,"2018-11-30"]
[null,null,null,null,null,null,null,null,null,null,null,null,null,null,null,"2018-12-01"]
[null,null,null,null,null,null,null,null,null,null,null,null,null,null,null,"2018-12-02"]
[null,null,null,null,null,null,null,null,null,null,null,null,null,null,null,"2018-12-03"]
[null,null,null,null,null,null,null,null,null,null,null,null,null,null,null,"2018-12-04"]
[null,null,null,null,null,null,null,null,null,null,null,null,null,null,null,"2018-12-05"]
[null,null,null,null,null,null,null,null,null,null,null,null,null,null,null,"2018-12-06"]
[null,null,null,null,null,null,null,null,null,null,null,null,null,null,null,"2018-12-07"]
[null,null,null,null,null,null,null,null,null,null,null,null,null,null,null,"2018-12-08"]
[null,null,null,null,null,null,null,null,null,null,null,null,null,null,null,"2018-12-09"]
[null,null,null,null,null,null,null,null,null,null,null,null,null,null,null,"2018-12-10"]
[null,null,null,null,null,null,null,null,null,null,null,null,null,null,null,"2018-12-11"]
[null,null,null,null,null,null,null,null,null,null,null,null,null,null,null,"2018-12-12"]
[null,null,null,null,null,null,null,null,null,null,null,null,null,null,null,"2018-12-13"]
[null,null,null,null,null,null,null,null,null,null,null,null,null,null,null,"2018-12-14"]
[null,null,null,null,null,null,null,null,null,null,null,null,null,null,null,"2018-12-15"]
[null,null,null,null,null,null,null,null,null,null,null,null,null,null,null,"2018-12-16"]
[null,null,null,null,null,null,null,null,null,null,null,null,null,null,null,"2018-12-17"]
[null,null,null,null,null,null,null,null,null,null,null,null,null,null,null,"2018-12-18"]
[null,null,null,null,null,null,null,null,null,null,null,null,null,null,null,"2018-12-19"]
[null,null,null,null,null,null,null,null,null,null,null,null,null,null,null,"2018-12-20"]
[null,null,null,null,null,null,null,null,null,null,null,null,null,null,null,"2018-12-21"]
[null,null,null,null,null,null,null,null,null,null,null,null,null,null,null,"2018-12-22"]
[null,null,null,null,null,null,null,null,null,null,null,null,null,null,null,"2018-12-23"]
[null,null,null,null,null,null,null,null,null,null,null,null,null,null,null,"2018-12-24"]
[null,null,null,null,null,null,null,null,null,null,null,null,null,null,null,"2018-12-25"]
[null,null,null,null,null,null,null,null,null,null,null,null,null,null,null,"2018-12-26"]
[null,null,null,null,null,null,null,null,null,null,null,null,null,null,null,"2018-12-27"]
[null,null,null,null,null,null,null,null,null,null,null,null,null,null,null,"2018-12-28"]
[null,null,null,null,null,null,null,null,null,null,null,null,null,null,null,"2018-12-29"]
[null,null,null,null,null,null,null,null,null,null,null,null,null,null,null,"2018-12-30"]
[null,null,null,null,null,null,null,null,null,null,null,null,null,null,null,"2018-12-31"]
[null,null,null,null,null,null,null,null,null,null,null,null,null,null,null,"2019-01-01"]
[null,null,null,null,null,null,null,null,null,null,null,null,null,null,null,"2019-01-02"]
[null,null,null,null,null,null,null,null,null,null,null,null,null,null,null,"2019-01-03"]
[null,null,null,null,null,null,null,null,null,null,null,null,null,null,null,"2019-01-04"]
[null,null,null,null,null,null,null,null,null,null,null,null,null,null,null,"2019-01-05"]
[null,null,null,null,null,null,null,null,null,null,null,null,null,null,null,"2019-01-06"]
[null,null,null,null,null,null,null,null,null,null,null,null,null,null,null,"2019-01-07"]
[null,null,null,null,null,null,null,null,null,null,null,null,null,null,null,"2019-01-08"]
[null,null,null,null,null,null,null,null,null,null,null,null,null,null,null,"2019-01-09"]
[null,null,null,null,null,null,null,null,null,null,null,null,null,null,null,"2019-01-10"]
[null,null,null,null,null,null,null,null,null,null,null,null,null,null,null,"2019-01-11"]
[null,null,null,null,null,null,null,null,null,null,null,null,null,null,null,"2019-01-12"]
[null,null,null,null,null,null,null,null,null,null,null,null,null,null,null,"2019-01-13"]
[null,null,null,null,null,null,null,null,null,null,null,null,null,null,null,"2019-01-14"]
[null,null,null,null,null,null,null,null,null,null,null,null,null,null,null,"2019-01-15"]
[null,null,null,null,null,null,null,null,null,null,null,null,null,null,null,"2019-01-16"]
[null,null,null,null,null,null,null,null,null,null,null,null,null,null,null,"2019-01-17"]
[null,null,null,null,null,null,null,null,null,null,null,null,null,null,null,"2019-01-18"]
[null,null,null,null,null,null,null,null,null,null,null,null,null,null,null,"2019-01-19"]
[null,null,null,null,null,null,null,null,null,null,null,null,null,null,null,"2019-01-20"]
[null,null,null,null,null,null,null,null,null,null,null,null,null,null,null,"2019-01-21"]
[null,null,null,null,null,null,null,null,null,null,null,null,null,null,null,"2019-01-22"]
[null,null,null,null,null,null,null,null,null,null,null,null,null,null,null,"2019-01-23"]
[null,null,null,null,null,null,null,null,null,null,null,null,null,null,null,"2019-01-24"]
[null,null,null,null,null,null,null,null,null,null,null,null,null,null,null,"2019-01-25"]
[null,null,null,null,null,null,null,null,null,null,null,null,null,null,null,"2019-01-26"]
[null,null,null,null,null,null,null,null,null,null,null,null,null,null,null,"2019-01-27"]
[null,null,null,null,null,null,null,null,null,null,null,null,null,null,null,"2019-01-28"]
[null,null,null,null,null,null,null,null,null,null,null,null,null,null,null,"2019-01-29"]
[null,null,null,null,null,null,null,null,null,null,null,null,null,null,null,"2019-01-30"]
[null,null,null,null,null,null,null,null,null,null,null,null,null,null,null,"2019-01-31"]
[null,null,null,null,null,null,null,null,null,null,null,null,null,null,null,"2019-02-01"]
[null,null,null,null,null,null,null,null,null,null,null,null,null,null,null,"2019-02-02"]
[null,null,null,null,null,null,null,null,null,null,null,null,null,null,null,"2019-02-03"]
[null,null,null,null,null,null,null,null,null,null,null,null,null,null,null,"2019-02-04"]
[null,null,null,null,null,null,null,null,null,null,null,null,null,null,null,"2019-02-05"]
[null,null,null,null,null,null,null,null,null,null,null,null,null,null,null,"2019-02-06"]
[null,null,null,null,null,null,null,null,null,null,null,null,null,null,null,"2019-02-07"]
[null,null,null,null,null,null,null,null,null,null,null,null,null,null,null,"2019-02-08"]
[null,null,null,null,null,null,null,null,null,null,null,null,null,null,null,"2019-02-09"]
[null,null,null,null,null,null,null,null,null,null,null,null,null,null,null,"2019-02-10"]
[null,null,null,null,null,null,null,null,null,null,null,null,null,null,null,"2019-02-11"]
[null,null,null,null,null,null,null,null,null,null,null,null,null,null,null,"2019-02-12"]
[null,null,null,null,null,null,null,null,null,null,null,null,null,null,null,"2019-02-13"]
[null,null,null,null,null,null,null,null,null,null,null,null,null,null,null,"2019-02-14"]
[null,null,null,null,null,null,null,null,null,null,null,null,null,null,null,"2019-02-15"]
[null,null,null,null,null,null,null,null,null,null,null,null,null,null,null,"2019-02-16"]
[null,null,null,null,null,null,null,null,null,null,null,null,null,null,null,"2019-02-17"]
[null,null,null,null,null,null,null,null,null,null,null,null,null,null,null,"2019-02-18"]
[null,null,null,null,null,null,null,null,null,null,null,null,null,null,null,"2019-02-19"]
[null,null,null,null,null,null,null,null,null,null,null,null,null,null,null,"2019-02-20"]
[null,null,null,null,null,null,null,null,null,null,null,null,null,null,null,"2019-02-21"]
[null,null,null,null,null,null,null,null,null,null,null,null,null,null,null,"2019-02-22"]
[null,null,null,null,null,null,null,null,null,null,null,null,null,null,null,"2019-02-23"]
[null,null,null,null,null,null,null,null,null,null,null,null,null,null,null,"2019-02-24"]
[null,null,null,null,null,null,null,null,null,null,null,null,null,null,null,"2019-02-25"]
[null,null,null,null,null,null,null,null,null,null,null,null,null,null,null,"2019-02-26"]
[null,null,null,null,null,null,null,null,null,null,null,null,null,null,null,"2019-02-27"]
[null,null,null,null,null,null,null,null,null,null,null,null,null,null,null,"2019-02-28"]
[null,null,null,null,null,null,null,null,null,null,null,null,null,null,null,"2019-03-01"]
[null,null,null,null,null,null,null,null,null,null,null,null,null,null,null,"2019-03-02"]
[null,null,null,null,null,null,null,null,null,null,null,null,null,null,null,"2019-03-03"]
[null,null,null,null,null,null,null,null,null,null,null,null,null,null,null,"2019-03-04"]
[null,null,null,null,null,null,null,null,null,null,null,null,null,null,null,"2019-03-05"]
[null,null,null,null,null,null,null,null,null,null,null,null,null,null,null,"2019-03-06"]
[null,null,null,null,null,null,null,null,null,null,null,null,null,null,null,"2019-03-07"]
[null,null,null,null,null,null,null,null,null,null,null,null,null,null,null,"2019-03-08"]
[null,null,null,null,null,null,null,null,null,null,null,null,null,null,null,"2019-03-09"]
[null,null,null,null,null,null,null,null,null,null,null,null,null,null,null,"2019-03-10"]
[null,null,null,null,null,null,null,null,null,null,null,null,null,null,null,"2019-03-11"]
[null,null,null,null,null,null,null,null,null,null,null,null,null,null,null,"2019-03-12"]
[null,null,null,null,null,null,null,null,null,null,null,null,null,null,null,"2019-03-13"]
[null,null,null,null,null,null,null,null,null,null,null,null,null,null,null,"2019-03-14"]
[null,null,null,null,null,null,null,null,null,null,null,null,null,null,null,"2019-03-15"]
[null,null,null,null,null,null,null,null,null,null,null,null,null,null,null,"2019-03-16"]
[null,null,null,null,null,null,null,null,null,null,null,null,null,null,null,"2019-03-17"]
[null,null,null,null,null,null,null,null,null,null,null,null,null,null,null,"2019-03-18"]
[null,null,null,null,null,null,null,null,null,null,null,null,null,null,null,"2019-03-19"]
[null,null,null,null,null,null,null,null,null,null,null,null,null,null,null,"2019-03-20"]
[null,null,null,null,null,null,null,null,null,null,null,null,null,null,null,"2019-03-21"]
[null,null,null,null,null,null,null,null,null,null,null,null,null,null,null,"2019-03-22"]
[null,null,null,null,null,null,null,null,null,null,null,null,null,null,null,"2019-03-23"]
[null,null,null,null,null,null,null,null,null,null,null,null,null,null,null,"2019-03-24"]
[null,null,null,null,null,null,null,null,null,null,null,null,null,null,null,"2019-03-25"]
[null,null,null,null,null,null,null,null,null,null,null,null,null,null,null,"2019-03-26"]
[null,null,null,null,null,null,null,null,null,null,null,null,null,null,null,"2019-03-27"]
[null,null,null,null,null,null,null,null,null,null,null,null,null,null,null,"2019-03-28"]
[null,null,null,null,null,null,null,null,null,null,null,null,null,null,null,"2019-03-29"]
[null,null,null,null,null,null,null,null,null,null,null,null,null,null,null,"2019-03-30"]
[null,null,null,null,null,null,null,null,null,null,null,null,null,null,null,"2019-03-31"]
[null,null,null,null,null,null,null,null,null,null,null,null,null,null,null,"2019-04-01"]
[null,null,null,null,null,null,null,null,null,null,null,null,null,null,null,"2019-04-02"]